{"text_format":"1","workbook":"xlsx","n_sheets":10,"sheets":["Read Me","Input-Output Module","M3-TCO-laadplein","Calculatie","M1-PowerSupply","M2-Subsidie","Invoer en categorieën","Parameters","Laadpleinkosten","Config"],"not_rendered":{"charts":0,"images":4,"macros":1,"external_links":3,"defined_names":40,"comments":0,"pivot_tables":0},"unopened":[],"bounds":{"document_bytes":16777216,"sheet_cells":100000,"rows_first":2000,"rows_last":500,"rows_between":2000,"halvings":0,"cell_chars":16384,"cell_head_chars":4096},"cells_cut":0,"cells_raw":0,"read":"whole","date_system":"1900"}

{"sheet":"Read Me","index":0,"n_rows":33,"n_cols":11,"rows_kept":33,"cut":false,"hidden":false,"merged":[]}
[]
[null,null,"Taal / Language"]
[null,null,"Nederlands"]
[null,null,null,null,null,null,{"$f":"IF($C$3=\"Nederlands\",J4,\nIF($C$3=\"English\",K4,K4))","v":"Voorwoord"},null,null,"Voorwoord","Preface"]
[null,null,null,null,null,null,{"$f":"IF($C$3=\"Nederlands\",J5,\nIF($C$3=\"English\",K5,K5))","v":"Het kostprijsmodel “TCO-ZET-Vracht” is in opdracht van Topsector Logistiek en het Ministerie van I&W door Panteia gebouwd en wordt door haar vervolgens onderhouden. Bij de ontwikkeling van dit TCO-model is gekozen voor een open en transparante opzet. Dit betekent dat helder is welke rekenregels zijn toegepast en welke waarde van de default data als uitgangswaarde is gehanteerd. Het TCO-model wordt mede onderschreven door RAI, evofenedex en TLN."},null,null,"Het kostprijsmodel “TCO-ZET-Vracht” is in opdracht van Topsector Logistiek en het Ministerie van I&W door Panteia gebouwd en wordt door haar vervolgens onderhouden. Bij de ontwikkeling van dit TCO-model is gekozen voor een open en transparante opzet. Dit betekent dat helder is welke rekenregels zijn toegepast en welke waarde van de default data als uitgangswaarde is gehanteerd. Het TCO-model wordt mede onderschreven door RAI, evofenedex en TLN.","The cost price model \"TCO-ZET-Vracht\" was built by Panteia on behalf of Top Sector Logistics and the Ministry of I&W and is subsequently maintained by it. In the development of this TCO-model an open and transparent approach has been chosen. This means that it is clear which calculation rules have been applied and which value of the default data has been used as a starting value. The TCO model is also endorsed by RAI, evofenedex and TLN."]
[]
[null,null,null,null,null,null,{"$f":"IF($C$3=\"Nederlands\",J7,\nIF($C$3=\"English\",K7,K7))","v":"Nieuw in TCO-ZET-Vracht versie 7.3 (d.d. 23-09-2024):"},null,null,"Nieuw in TCO-ZET-Vracht versie 7.3 (d.d. 23-09-2024):","New in TCO-ZET-Vracht version 7.3 (d.d. 23-09-2024):"]
[null,null,null,null,null,null,{"$f":"IF($C$3=\"Nederlands\",J8,\nIF($C$3=\"English\",K8,K8))","v":"In versie 7.3 is ten opzichte van de voorgaande versie  het prijsniveau van de defaultwaarden verlegd van 2023 naar 2024. De belangrijkste wijzigingen zijn:\n- Nieuwprijs dieselvoertuigen:\t+5,3%\n- Nieuwprijs BEV:\t\t\t-6,1%\n- Nieuwprijs FCEV, H2ICE:\t\t+2,9%\n- Aanschafprijs laadpalen:\t\t-19%\t\n\nN.B.: De vermelde defaultwaarden kunnen naar eigen inzicht worden overschreven. \n\nNaast de subsidie op de aanschaf van zero-emissievoertuigen (AanZET) is nu ook de subsidie op laadinfrastructuur (SPRILA) in het kostenmodel opgenomen. Het betreft hierbij een subsidie op de aanschaf van laadpalen, de aanleg van het laadstation en de eventuele stationaire batterij."},null,null,"In versie 7.3 is ten opzichte van de voorgaande versie  het prijsniveau van de defaultwaarden verlegd van 2023 naar 2024. De belangrijkste wijzigingen zijn:\n- Nieuwprijs dieselvoertuigen:\t+5,3%\n- Nieuwprijs BEV:\t\t\t-6,1%\n- Nieuwprijs FCEV, H2ICE:\t\t+2,9%\n- Aanschafprijs laadpalen:\t\t-19%\t\n\nN.B.: De vermelde defaultwaarden kunnen naar eigen inzicht worden overschreven. \n\nNaast de subsidie op de aanschaf van zero-emissievoertuigen (AanZET) is nu ook de subsidie op laadinfrastructuur (SPRILA) in het kostenmodel opgenomen. Het betreft hierbij een subsidie op de aanschaf van laadpalen, de aanleg van het laadstation en de eventuele stationaire batterij.","In version 7.3, compared to the previous version, the price level of the defaults has been shifted from 2023 to 2024. The main changes are:\n- Purchase price diesel vehicle: \t+5.3%\n- Purchase price BEV:\t\t\t-6,1%\n- Purchase price FCEV, H2ICE: \t\t+2.9%\n- Purchase price of charging stations:\t-19%\t\n\nNote: The default values listed can be overridden at your discretion. \n\nIn addition to the subsidy on the purchase of zero-emission vehicles (AanZET), the subsidy on charging infrastructure (SPRILA) is now also included in the cost model. This is a subsidy on the purchase of charging stations, the construction of the charging station and if any, a stationary battery."]
[]
[]
{"$rows_left_out":24}
{"sheet":"Input-Output Module","index":1,"n_rows":130,"n_cols":8,"rows_kept":130,"cut":false,"hidden":false,"merged":[[57,4,57,6],[27,3,27,5],[19,5,19,7],[46,3,46,5],[3,4,6,7]]}
[]
[]
[null,null,null,null,"Disclaimer:"]
[null,null,null,null,{"$f":"Config!$A$36","v":"De in het TCO-Vracht gebruikte default- c.q. standaardwaarden zijn met de grootste zorg verzameld. Het betreft echter gemiddelde cijfers, de werkelijke cijfers kunnen ofwel hoger dan wel lager zijn. Hoewel veel zorg is besteed aan de correctheid van de rekenregels en de gebruikte inputdata, is Panteia of de Topsector Logistiek niet aansprakelijk te houden voor de juistheid van de rekenresultaten. "}]
[]
[]
[]
[]
[null,"Input-output module",null,null,"TCO-ZET-Vracht"," "]
[null,null,null,null,{"$f":"IF('Read Me'!$C$3=\"Nederlands\",_xlfn.CONCAT(\"versie \",Config!$B$1),_xlfn.CONCAT(\"version \",Config!$B$1))","v":"versie 7.3"},"2024-09-23"]
{"$rows_left_out":121}
{"sheet":"M3-TCO-laadplein","index":2,"n_rows":53,"n_cols":23,"rows_kept":53,"cut":false,"hidden":false,"merged":[[22,18,22,19],[21,16,21,20],[40,18,40,19],[32,7,34,10],[48,7,48,9],[46,18,46,19],[44,18,44,19],[43,18,43,19],[42,18,42,19],[41,18,41,19],[24,18,24,19],[25,18,25,19],[26,18,26,19],[27,18,27,19],[23,16,23,20],[55,6,56,12],[50,18,50,19],[49,18,49,19],[48,18,48,19],[47,18,47,19],[17,1,17,2],[19,1,25,4],[15,1,15,2],[16,1,16,2],[36,6,37,12],[2,1,3,8],[2,9,3,13],[2,15,3,22],[5,2,6,8],[5,12,5,13],[5,14,7,14],[5,15,7,15],[5,16,7,16],[5,17,6,22],[6,10,7,10],[6,11,7,11],[6,12,7,12],[6,13,7,13],[5,9,5,11],[6,9,7,9]]}
[]
[]
[null,{"$f":"Config!$A$54","v":"Stap 1\nVul het verwachte aantal elektrische vrachtvoertuigen per type op uw vestiging in de huidige situatie en in de komende tien jaar (per 2 jaar). Houd hierbij rekening met het aantal voertuigen dat tegelijk zal opladen (waardoor tegelijkertijd een laadbehoefte ontstaat).\nBelangrijk: Het invullen van het totale wagenpark moet voor ieder jaar afzonderlijk gebeuren. Vul in de eerste kolom het huidige aantal e-voertuigen in dat u al heeft."},null,null,null,null,null,null,null,{"$f":"Config!$A$55","v":"Stap 2\nGeef het verwachte jaarkilometrage (per voertuigtype) van uw voertuigen op. Op basis hiervan is een gemiddelde per dag berekend. Als dit sterk afwijkt van uw maximale dagelijkse afstand, vul dan zelf deze waarde in (kolom [Maximum per dag]). Per voertuigtype is een inschatting gemaakt van het gemiddelde energieverbruik. Weet u het energieverbruik? Vul deze dan zelf in de kolom [Eigen input] in."},null,null,null,null,null,{"$f":"Config!$A$56","v":"Stap 3\nVul per voertuigtype de hoeveel tijd (uren) in dat de vrachtwagens per dag kunnen opladen. Op basis van de benodigde energievraag wordt de kleinst mogelijke laadpaal berekend. U kunt deze vervangen met een eigen keuze. Let op: u kunt alleen een laadpaal met een hoger vermogen kiezen."}]
[]
[]
[null,null,{"$f":"IF('Read Me'!$C$3=\"Nederlands\",\n\"Stel uw vloot samen\",\n\"set up your vehicle park\"\n)","v":"Stel uw vloot samen"},null,null,null,null,null,null,{"$f":"IF('Read Me'!$C$3=\"Nederlands\",\"Kilometrage [km]\",\"Mileage [km]\")","v":"Kilometrage [km]"},null,null,{"$f":"IF('Read Me'!$C$3=\"Nederlands\",\"Energie gebruik [kWh/km]\",\"Energy use [kWh/km]\")","v":"Energie gebruik [kWh/km]"},null,{"$f":"IF('Read Me'!$C$3=\"Nederlands\",\"Jaarlijks energie gebruik per voertuig [kWh]\",\"Yearly energy use per vehicle [kWh]\")","v":"Jaarlijks energie gebruik per voertuig [kWh]"},{"$f":"IF('Read Me'!$C$3=\"Nederlands\",\"Aantal uren per dag terug op depot\",\"Amount of hours on own location\")","v":"Aantal uren per dag terug op depot"},{"$f":"IF('Read Me'!$C$3=\"Nederlands\",\"Kleinst bruikbare laadpaal\",\"Least heavy charging station\")","v":"Kleinst bruikbare laadpaal"},{"$f":"IF('Read Me'!$C$3=\"Nederlands\",\"Minimaal aantal benodigde laadpalen in:\",\"Minimum charging stations needed in:\")","v":"Minimaal aantal benodigde laadpalen in:"}]
[null,null,null,null,null,null,null,null,null,{"$f":"IF('Read Me'!$C$3=\"Nederlands\",\"Jaarlijks per voertuig\",\"annually per vehicle\")","v":"Jaarlijks per voertuig"},{"$f":"IF('Read Me'!$C$3=\"Nederlands\",\"Gemiddeld per dag\",\"Daily average\")","v":"Gemiddeld per dag"},{"$f":"IF('Read Me'!$C$3=\"Nederlands\",\"Maximum per dag\",\"Daily max\")","v":"Maximum per dag"},{"$f":"IF('Read Me'!$C$3=\"Nederlands\",\"Advies\",\"Advice\")","v":"Advies"},{"$f":"IF('Read Me'!$C$3=\"Nederlands\",\"Eigen input\",\"Own input\")","v":"Eigen input"}]
[null,null,null,{"$f":"'Input-Output Module'!$D$20","v":2024},{"$f":"D8+2","v":2026},{"$f":"E8+2","v":2028},2030,2032,2034,null,null,null,null,null,null,null,null,{"$f":"D8","v":2024},{"$f":"E8","v":2026},2028,2030,2032,2034]
[null,null,"Bestelwagens (tot 3,5 ton)",0,{"$f":"$D$9","v":0},{"$f":"$E$9","v":0},{"$f":"$F$9","v":0},{"$f":"$G$9","v":0},{"$f":"$H$9","v":0},30000,{"$f":"J9/INDEX(InzetVoertuigPar[[#All],[Waarde]],MATCH(\"Productieve dagen per jaar\",InzetVoertuigPar[[#All],[Variabele]],0))","v":115.38461538461539},null,{"$f":"IF(C9=$C$9,0.3,INDEX(EnergieverbruikEnOnderhoudPerType[[#All],[Rijden EV '[kWh/km']]],MATCH('M3-TCO-laadplein'!B9,EnergieverbruikEnOnderhoudPerType[[#All],[Type ID]],0)))","v":0.3},null,{"$f":"IF(N9<>\"\",N9,M9)*J9","v":9000},8,{"$f":"IFERROR(INDEX(LaadinfraPrivaat[[#All],[Charging type]],MATCH((IF($L$9>0,$L$9,$K$9)*IF($N$9>0,$N$9,$M$9))/$P$9,LaadinfraPrivaat[[#All],[Power (kW)]],-1)),Config!$A$57)","v":"AC11"},{"$f":"ROUNDUP((D9*(IF($L9<>\"\",$L9,$K9)*IF($N9<>\"\",$N9,$M9))/$P9)/INDEX(LaadinfraPrivaat[[#All],[Power (kW)]],MATCH('M3-TCO-laadplein'!Q9,LaadinfraPrivaat[[#All],[Charging type]],0)),0)","v":0},{"$f":"ROUNDUP((E9*(IF($L9<>\"\",$L9,$K9)*IF($N9<>\"\",$N9,$M9))/$P9)/INDEX(LaadinfraPrivaat[[#All],[Power (kW)]],MATCH('M3-TCO-laadplein'!Q9,LaadinfraPrivaat[[#All],[Charging type]],0)),0)","v":0},{"$f":"ROUNDUP((F9*(IF($L9<>\"\",$L9,$K9)*IF($N9<>\"\",$N9,$M9))/$P9)/INDEX(LaadinfraPrivaat[[#All],[Power (kW)]],MATCH('M3-TCO-laadplein'!Q9,LaadinfraPrivaat[[#All],[Charging type]],0)),0)","v":0},{"$f":"ROUNDUP((G9*(IF($L9<>\"\",$L9,$K9)*IF($N9<>\"\",$N9,$M9))/$P9)/INDEX(LaadinfraPrivaat[[#All],[Power (kW)]],MATCH('M3-TCO-laadplein'!Q9,LaadinfraPrivaat[[#All],[Charging type]],0)),0)","v":0},{"$f":"ROUNDUP((H9*(IF($L9<>\"\",$L9,$K9)*IF($N9<>\"\",$N9,$M9))/$P9)/INDEX(LaadinfraPrivaat[[#All],[Power (kW)]],MATCH('M3-TCO-laadplein'!Q9,LaadinfraPrivaat[[#All],[Charging type]],0)),0)","v":0},{"$f":"ROUNDUP((I9*(IF($L9<>\"\",$L9,$K9)*IF($N9<>\"\",$N9,$M9))/$P9)/INDEX(LaadinfraPrivaat[[#All],[Power (kW)]],MATCH('M3-TCO-laadplein'!Q9,LaadinfraPrivaat[[#All],[Charging type]],0)),0)","v":0}]
[null,1,{"$f":"IF('Read Me'!$C$3=\"Nederlands\",\n\"Kleine bakwagen (lvm 6 ton)\",\n\"Small truck (load 6 tonnes)\"\n)","v":"Kleine bakwagen (lvm 6 ton)"},0,{"$f":"$D$10","v":0},{"$f":"$E$10","v":0},{"$f":"$F$10","v":0},{"$f":"$G$10","v":0},{"$f":"$H$10","v":0},{"$f":"INDEX(Voertuigen[[#All],[Kilometrage]],MATCH($B$10,Voertuigen[[#All],[Type ID]],0))","v":35000},{"$f":"J10/INDEX(InzetVoertuigPar[[#All],[Waarde]],MATCH(\"Productieve dagen per jaar\",InzetVoertuigPar[[#All],[Variabele]],0))","v":134.61538461538461},null,{"$f":"IF(C10=$C$9,0.3,INDEX(EnergieverbruikEnOnderhoudPerType[[#All],[Rijden EV '[kWh/km']]],MATCH('M3-TCO-laadplein'!B10,EnergieverbruikEnOnderhoudPerType[[#All],[Type ID]],0)))","v":0.47615518249999916},null,{"$f":"IF(N10<>\"\",N10,M10)*J10","v":16665.431387499972},8,{"$f":"IFERROR(INDEX(LaadinfraPrivaat[[#All],[Charging type]],MATCH((IF($L$10>0,$L$10,$K$10)*IF($N$10>0,$N$10,$M$10))/P10,LaadinfraPrivaat[[#All],[Power (kW)]],-1)),Config!$A$57)","v":"AC11"},{"$f":"ROUNDUP((D10*(IF($L10<>\"\",$L10,$K10)*IF($N10<>\"\",$N10,$M10))/$P10)/INDEX(LaadinfraPrivaat[[#All],[Power (kW)]],MATCH('M3-TCO-laadplein'!Q10,LaadinfraPrivaat[[#All],[Charging type]],0)),0)","v":0},{"$f":"ROUNDUP((E10*(IF($L10<>\"\",$L10,$K10)*IF($N10<>\"\",$N10,$M10))/$P10)/INDEX(LaadinfraPrivaat[[#All],[Power (kW)]],MATCH('M3-TCO-laadplein'!Q10,LaadinfraPrivaat[[#All],[Charging type]],0)),0)","v":0},{"$f":"ROUNDUP((F10*(IF($L10<>\"\",$L10,$K10)*IF($N10<>\"\",$N10,$M10))/$P10)/INDEX(LaadinfraPrivaat[[#All],[Power (kW)]],MATCH('M3-TCO-laadplein'!Q10,LaadinfraPrivaat[[#All],[Charging type]],0)),0)","v":0},{"$f":"ROUNDUP((G10*(IF($L10<>\"\",$L10,$K10)*IF($N10<>\"\",$N10,$M10))/$P10)/INDEX(LaadinfraPrivaat[[#All],[Power (kW)]],MATCH('M3-TCO-laadplein'!Q10,LaadinfraPrivaat[[#All],[Charging type]],0)),0)","v":0},{"$f":"ROUNDUP((H10*(IF($L10<>\"\",$L10,$K10)*IF($N10<>\"\",$N10,$M10))/$P10)/INDEX(LaadinfraPrivaat[[#All],[Power (kW)]],MATCH('M3-TCO-laadplein'!Q10,LaadinfraPrivaat[[#All],[Charging type]],0)),0)","v":0},{"$f":"ROUNDUP((I10*(IF($L10<>\"\",$L10,$K10)*IF($N10<>\"\",$N10,$M10))/$P10)/INDEX(LaadinfraPrivaat[[#All],[Power (kW)]],MATCH('M3-TCO-laadplein'!Q10,LaadinfraPrivaat[[#All],[Charging type]],0)),0)","v":0}]
{"$rows_left_out":44}
{"sheet":"Calculatie","index":3,"n_rows":57,"n_cols":26,"rows_kept":57,"cut":false,"hidden":false,"merged":[[14,1,14,4],[15,1,15,4]]}
["BASIS INVOERGEGEVENS"]
["Voertuig / ID",{"$f":"Voertuigtype","v":"Medium bakwagen (lvm ca. 9 ton)"},{"$f":"INDEX(Voertuigen[#All],MATCH(Calculatie!B2,Voertuigen[[#All],[Voertuig]],0),2)","v":3},null,null,"test","Dit is een overgenomen veld"]
["Voertuigtype / ID",{"$f":"INDEX(Voertuigen[#All],MATCH(Calculatie!B2,Voertuigen[[#All],[Voertuig]],0),3)","v":"Medium bakwagen"},{"$f":"INDEX(Voertuigen[#All],MATCH(Calculatie!B2,Voertuigen[[#All],[Voertuig]],0),4)","v":2},null,null,"test","Dit is een berekening"]
["Verwacht jaarkilometrage",{"$f":"Kilometrage","v":70000}]
["Grijze/groene elektriciciteit",{"$f":"Elec_type","v":"Groen"}]
["Grijze/groene waterstof",{"$f":"H2_type","v":"Electrolyse (hernieuwbare energie)"}]
["Rechtsvorm en belastingpercentage",{"$f":"Belasting","v":"BV of NV met 19% belasting"}]
["Grootte van bedrijf",{"$f":"Bedrijfsgrootte","v":"Groot"},null,null,null,null,null,null,null,null,"Berekeningen Laadpleinmodel"]
[null,null,null,null,null,null,null,null,null,null,"Aantal laadpalen en piekvermogen"]
["INZETGEGEVENS VOERTUIG SYSTEM","DV","EV","FC","H2ICE-CI",null,null,null,null,null,"Laadpaal","Vermogen [kW/u]","jaar 0","jaar 1-2","jaar 3-4","jaar 5-6","jaar 7-8","jaar 9-10","OPEX",null,"Relevantie subsidie SPRILA"]
{"$rows_left_out":48}
{"sheet":"M1-PowerSupply","index":4,"n_rows":51,"n_cols":15,"rows_kept":51,"cut":false,"hidden":false,"merged":[]}
["BASIS INVOERGEGEVENS"]
["Voertuig / ID",{"$f":"Voertuigtype","v":"Medium bakwagen (lvm ca. 9 ton)"},{"$f":"INDEX(Voertuigen[#All],MATCH(Calculatie!B2,Voertuigen[[#All],[Voertuig]],0),2)","v":3},null,null,"test","Dit is een overgenomen veld"]
["Voertuigtype / ID",{"$f":"INDEX(Voertuigen[#All],MATCH(Calculatie!B2,Voertuigen[[#All],[Voertuig]],0),3)","v":"Medium bakwagen"},{"$f":"INDEX(Voertuigen[#All],MATCH(Calculatie!B2,Voertuigen[[#All],[Voertuig]],0),4)","v":2},null,null,"test","Dit is een berekening"]
["Verwacht jaarkilometrage",{"$f":"Kilometrage","v":70000}]
["Grijze/groene elektriciciteit",{"$f":"Elec_type","v":"Groen"}]
["Grijze/groene waterstof",{"$f":"H2_type","v":"Electrolyse (hernieuwbare energie)"}]
["Rechtsvorm en belastingpercentage",{"$f":"Belasting","v":"BV of NV met 19% belasting"}]
["Grootte van bedrijf",{"$f":"Bedrijfsgrootte","v":"Groot"}]
["Gekoeld?",{"$f":"Koeling","v":"Nee"}]
["Km/dag",{"$f":"Calculatie!B16","v":269.23076923076923}]
{"$rows_left_out":42}
{"sheet":"M2-Subsidie","index":5,"n_rows":59,"n_cols":14,"rows_kept":59,"cut":false,"hidden":false,"merged":[]}
[]
["Samenvatting gegevens"]
["Voertuigtype",{"$f":"Calculatie!$B$3","v":"Medium bakwagen"},null,null,null,"Parameters"]
["Voertuigtype ID",{"$f":"Calculatie!$C$3","v":2},null,null,null,"Maximale steun per categorie",null,null,null,null,"Percentage en investering per jaar"]
["Voertuig categorie",{"$f":"INDEX(AanzetCAT[#All],$B$4+1,2)","v":"N3 Bakwagen (lvm <= 18t)"},null,null,null,"AanZET categorie","Omvang bedrijf","Max. steun [%]","Max. steun [€]",null,"Jaartal","MIA voertuig (D3116)%","MIA Laadpaal (G3721)%","Min. Investering2"]
["Rechtsvorm en belastingpercentage",{"$f":"INDEX(Belastinggegevens[[#All],[Belastingsklasse]],MATCH(Calculatie!$B$7,Keuzevelden[[#All],[Rechtsvorm en belastingpercentage]],0))","v":"BV of NV met 19% belasting"},null,null,null,"N2","Middelgroot",0.12,14700,null,2021,0.36,null,2500]
["Basisjaar prognose",{"$f":"MIN(YEAR(NOW()),MAX(MIAperJaar[[#All],[Jaartal]]))","v":2024},null,null,null,"N2","Klein",0.14799999999999999,18800,null,2022,0.45,null,2500]
["Grootte van bedrijf",{"$f":"INDEX(MaxStaatsSteun[[#All],[Omvang bedrijf]],MATCH(Calculatie!$B$8,Keuzevelden[[#All],[Grootte van bedrijf]],0))","v":"Groot"},null,null,null,"N2","Groot",6.0999999999999999E-2,7500,null,2023,0.36,null,2500]
["Minimale investering",{"$f":"INDEX(MIAperJaar[[#All],[MIA Laadpaal (G3721)%]],MATCH($B$7,MIAperJaar[[#All],[Jaartal]],0))","v":0.45},null,null,null,"N3 Bakwagen (lvm <= 18t)","Middelgroot",0.2,60500,null,2024,0.36,0.45,2500]
[null,null,null,null,null,"N3 Bakwagen (lvm <= 18t)","Klein",0.28599999999999998,86600]
{"$rows_left_out":50}
{"sheet":"Invoer en categorieën","index":6,"n_rows":91,"n_cols":20,"rows_kept":91,"cut":false,"hidden":false,"merged":[]}
[]
[null,"Voertuigen en kenmerken",null,null,null,null,null,null,null,null,null,null,null,null,"Opties keuzevelden en defaultwaarden"]
[null,"Basisjaar financiële cijfers:",2024,"(relevant voor indexatie)"]
[null,"Voertuig","Voertuig ID","Type","Type ID","Casco kosten voertuig (DV)","H2ICE Casco","Aanschaf koelsysteem","Kilometrage","Productive uren per jaar","Afschrijftermijn","Uurloon",null,null,"Optie","Grijze/groene elektriciciteit","Grijze/groene waterstof","Rechtsvorm en belastingpercentage","Grootte van bedrijf","Subsie laadpaal"]
[null,{"$f":"Config!A37","v":"Kleine bakwagen (lvm ca. 6 ton)"},1,{"$f":"Config!A47","v":"Kleine bakwagen"},1,87345.375,0,17500,35000,2600,7,32.799999999999997,null,null,"keuze 1",{"$f":"Config!$A$15","v":"Grijs"},{"$f":"Config!$A$15","v":"Grijs"},{"$f":"Config!$A$20","v":"BV of NV met 19% belasting"},{"$f":"Config!$A$26","v":"Groot"},{"$f":"Config!$A$73","v":"Geen subsieregeling"}]
[null,{"$f":"Config!A38","v":"Kleine bakwagen/ Verhuiswagen"},2,{"$f":"Config!A47","v":"Kleine bakwagen"},1,70483.92,0,0,35000,1600,5,25.735705209656924,null,null,"keuze 2",{"$f":"Config!$A$16","v":"Groen"},{"$f":"Config!$A$17","v":"Blauw"},{"$f":"Config!$A$21","v":"BV of NV met 25,8% belasting"},{"$f":"Config!$A$25","v":"Middelgroot"},{"$f":"Config!$A$74","v":"MIA subsidie"}]
[null,{"$f":"Config!A39","v":"Medium bakwagen (lvm ca. 9 ton)"},3,{"$f":"Config!A48","v":"Medium bakwagen"},2,124030.43249999998,0,20000,70000,2600,7,32.799999999999997,null,null,"keuze 3",null,{"$f":"Config!$A$18","v":"Electrolyse (netstroom)"},{"$f":"Config!$A$22","v":"Eenmanszaak met 36,93% belasting"},{"$f":"Config!$A$24","v":"Klein"},{"$f":"Config!$A$75","v":"SPRILA"}]
[null,{"$f":"Config!A40","v":"Medium bakwagen/ Verhuiswagen"},4,{"$f":"Config!A48","v":"Medium bakwagen"},2,138537.35999999999,0,0,30000,1800,8,30.736975857687419,null,null,"keuze 4",null,{"$f":"Config!$A$19","v":"Electrolyse (hernieuwbare energie)"},{"$f":"Config!$A$23","v":"Eenmanszaak met 49,5% belasting"}]
[null,{"$f":"Config!A41","v":"Grote bakwagen (lvm > 16 ton)"},5,{"$f":"Config!A49","v":"Grote bakwagen"},3,138987.745,0,22500,70000,2600,7,32.799999999999997,null,null,"keuze 5"]
[null,{"$f":"Config!A42","v":"Grote bakwagen/ Verhuiswagen"},6,{"$f":"Config!A49","v":"Grote bakwagen"},3,146830.84,0,0,47000,2000,11,30.111817026683607,null,null,"keuze 6"]
{"$rows_left_out":82}
{"sheet":"Parameters","index":7,"n_rows":54,"n_cols":11,"rows_kept":54,"cut":false,"hidden":false,"merged":[]}
[]
[null,"Energieprijzen",null,null,null,2024,null,"HERNIEUWBARE ENERGIE-EENHEDEN (HEB's)"]
[null,"Item","Variabele","Waarde","toelichting",null,null,"Variabele","Waarde","toelichting"]
[null,"Dieselprijs","Literprijs",1.0900000000000001,"Kale prijs diesel per liter",null,null,"Multiplier EV",4]
[null,"Dieselprijs","Accijns",0.51629999999999998,"Accijns diesel per liter",null,null,"Multiplier FC",2.5]
[null,"Elektriciteitsprijs","kWh",{"$f":"Laadpleinkosten!C31","v":0.21537000000000001},"inkoopprijs stroom per kWh",null,null,"Aandeel groene energie 'grijze' stroom",0.26400000000000001]
[null,"Waterstofprijs",{"$f":"Config!$A$15","v":"Grijs"},7.56,"Inkoopprijs grijze waterstof per liter",null,null,"Waarde HBE",9.5]
[null,"Waterstofprijs",{"$f":"Config!$A$17","v":"Blauw"},8.06,"Inkoopprijs blauwe waterstof per liter",null,null,"Energiewaarde (MJ) per kg H2",120.1]
[null,"Waterstofprijs",{"$f":"Config!$A$18","v":"Electrolyse (netstroom)"},10,"Inkoopprijs waterstof per liter",null,null,"Vaste kosten registratie (per jaar)",2000]
[null,"Waterstofprijs",{"$f":"Config!$A$19","v":"Electrolyse (hernieuwbare energie)"},19,"Inkoopprijs waterstof per liter"]
{"$rows_left_out":45}
{"sheet":"Laadpleinkosten","index":8,"n_rows":41,"n_cols":17,"rows_kept":41,"cut":false,"hidden":false,"merged":[]}
["Basis"]
[null,null,null,null," "]
[null,null,null," "]
["Overzicht aannames TCO/kWh prijs op diverse laadpalen"]
["Alle bedragen excl. BTW"]
[" ","2024-06-24"," "]
[null,null,"AC3,7","AC11","AC22","AC43","DC50","DC150","DC350","DC600","DC1000"," "]
[null,null,"3,7 kW","11 kW","22 kW","43 kW","50 kW","150 kW","350 kW","600 kW","1000 kW",null," "]
[null,null,"privaat","privaat","privaat","privaat","privaat","privaat","privaat","privaat","privaat"," "]
["CAPEX, Plaatsing",null,"3x25A","3x25A","3x35A","3x63A","3x80A",null,null,null,null," "]
{"$rows_left_out":32}
{"sheet":"Config","index":9,"n_rows":78,"n_cols":17,"rows_kept":78,"cut":false,"hidden":false,"merged":[[8,0,8,2]]}
["Versie","7.3"]
[]
[]
[]
[]
[]
[]
[]
["Invoervelden",null,null,null,null,null,null,null,"Formatteren subsidie-waarden"]
["Lan","Dutch","English",null,null,null,null,null,null,"EV","FC","h2ICE"]
{"$rows_left_out":68}