{"text_format":"1","workbook":"xlsx","n_sheets":10,"sheets":["Read Me","Input-Output Module","M3-TCO-laadplein","Calculatie","M1-PowerSupply","M2-Subsidie","Invoer en categorieën","Parameters","Laadpleinkosten","Config"],"not_rendered":{"charts":0,"images":4,"macros":1,"external_links":3,"defined_names":40,"comments":0,"pivot_tables":0},"unopened":[],"bounds":{"document_bytes":16777216,"sheet_cells":100000,"rows_first":2000,"rows_last":500,"rows_between":2000,"halvings":0,"cell_chars":16384,"cell_head_chars":4096},"cells_cut":0,"cells_raw":0,"read":"whole","date_system":"1900"}

{"sheet":"Read Me","index":0,"n_rows":36,"n_cols":11,"rows_kept":36,"cut":false,"hidden":false,"merged":[]}
[]
[null,null,"Taal / Language"]
[null,null,"Nederlands"]
[null,null,null,null,null,null,{"$f":"IF($C$3=\"Nederlands\",J4,\nIF($C$3=\"English\",K4,K4))","v":"Voorwoord"},null,null,"Voorwoord","Preface"]
[null,null,null,null,null,null,{"$f":"IF($C$3=\"Nederlands\",J5,\nIF($C$3=\"English\",K5,K5))","v":"Het kostprijsmodel “TCO-ZET-Vracht” is in opdracht van Topsector Logistiek en het Ministerie van I&W door Panteia gebouwd en wordt door haar vervolgens onderhouden. Bij de ontwikkeling van dit TCO-model is gekozen voor een open en transparante opzet. Dit betekent dat helder is welke rekenregels zijn toegepast en welke waarde van de default data als uitgangswaarde is gehanteerd. Het TCO-model wordt mede onderschreven door RAI, evofenedex en TLN."},null,null,"Het kostprijsmodel “TCO-ZET-Vracht” is in opdracht van Topsector Logistiek en het Ministerie van I&W door Panteia gebouwd en wordt door haar vervolgens onderhouden. Bij de ontwikkeling van dit TCO-model is gekozen voor een open en transparante opzet. Dit betekent dat helder is welke rekenregels zijn toegepast en welke waarde van de default data als uitgangswaarde is gehanteerd. Het TCO-model wordt mede onderschreven door RAI, evofenedex en TLN.","The cost price model \"TCO-ZET-Vracht\" was built by Panteia on behalf of Top Sector Logistics and the Ministry of I&W and is subsequently maintained by it. In the development of this TCO-model an open and transparent approach has been chosen. This means that it is clear which calculation rules have been applied and which value of the default data has been used as a starting value. The TCO model is also endorsed by RAI, evofenedex and TLN."]
[]
[null,null,null,null,null,null,{"$f":"IF($C$3=\"Nederlands\",J7,\nIF($C$3=\"English\",K7,K7))","v":"Nieuw in TCO-ZET-Vracht versie 6.2 (d.d. 01-03-2024):"},null,null,"Nieuw in TCO-ZET-Vracht versie 6.2 (d.d. 01-03-2024):","New in TCO-ZET-Vracht version 6.2 (d.d. 01-03-2024):"]
[null,null,null,null,null,null,{"$f":"IF($C$3=\"Nederlands\",J8,\nIF($C$3=\"English\",K8,K8))","v":"In versie 6.2 zijn enkele functionele veranderingen doorgevoerd. Dit heeft invloed op de (keuze)mogelijkheden in het model en de invoer. De volgende functies zijn toegevoegd:\n- Extra voertuigen om uit te kiezen\n- Het model onderscheidt een extra optie voor zware trekkers: H2ICE\n- De optie om een laadplein in te voeren. Dit is optioneel. Zonder gebruik van het laadplein berekent het model kosten voor de laadinfra voor een EV-voertuig en koppelt deze geheel aan dat voertuig. Door gebruik te maken van het laadplein is het mogelijk deze laadinfra-kosten te verdelen over een vloot aan voertuigen.\n- De waarde vermeldt in de \"blauwe velden\" kan handmatig overschreven worden. De \"grijze velden\" zijn niet aanpasbaar. Met de resetknop: “Herstel invoervelden”, wordt teruggegaan naar de oorspronkelijke (default-) waarde.\n- Binnen de laadpleinmodule (sheet: M3-TCO-Laadplein) is informatie over de stationaire batterij toegevoegd. Als zo'n batterij vanuit kostenperspectief een interessante optie kan zijn, wordt hiervan een melding gegeven."},null,null,"In versie 6.2 zijn enkele functionele veranderingen doorgevoerd. Dit heeft invloed op de (keuze)mogelijkheden in het model en de invoer. De volgende functies zijn toegevoegd:\n- Extra voertuigen om uit te kiezen\n- Het model onderscheidt een extra optie voor zware trekkers: H2ICE\n- De optie om een laadplein in te voeren. Dit is optioneel. Zonder gebruik van het laadplein berekent het model kosten voor de laadinfra voor een EV-voertuig en koppelt deze geheel aan dat voertuig. Door gebruik te maken van het laadplein is het mogelijk deze laadinfra-kosten te verdelen over een vloot aan voertuigen.\n- De waarde vermeldt in de \"blauwe velden\" kan handmatig overschreven worden. De \"grijze velden\" zijn niet aanpasbaar. Met de resetknop: “Herstel invoervelden”, wordt teruggegaan naar de oorspronkelijke (default-) waarde.\n- Binnen de laadpleinmodule (sheet: M3-TCO-Laadplein) is informatie over de stationaire batterij toegevoegd. Als zo'n batterij vanuit kostenperspectief een interessante optie kan zijn, wordt hiervan een melding gegeven.","In version 6.2 some functional changes have been made. This influences the (input)abiliites of the model and the variables. The following functions have been added:\n- Extra vehicle types to choose from\n- The model will add an extra combustion type for the heavy tractor to the equation: H2ICE\n- The option to add the total charging-infra [optional]. Without this option the model calculates charging infra costs for the selected EV-vehicle and charges those costs completely to that vehicle. By using this option it is possible to divide the charging infra costs over all vehicles of the company.\n- The value listed in the \"blue fields\" can be manually overwritten. The \"grey fields\" are not editable. With the reset button: \"Reset input\", the original (default) value is returned to.\n- - Within the charging square module (sheet: M3-TCO-laadplein), information about the stationary battery has been added. If such a battery can be an interesting option from a cost perspective, a notification of this is given."]
[]
[null,null,null,null,null,null,{"$f":"IF($C$3=\"Nederlands\",J10,\nIF($C$3=\"English\",K10,K10))","v":"Nieuw in TCO-ZET-Vracht versie 5.0 (d.d. 19-5-2023):"},null,null,"Nieuw in TCO-ZET-Vracht versie 5.0 (d.d. 19-5-2023):","New in TCO-ZET-Vracht version 5.0 (d.d. 19-5-2023):"]
{"$rows_left_out":27}
{"sheet":"Input-Output Module","index":1,"n_rows":128,"n_cols":8,"rows_kept":128,"cut":false,"hidden":false,"merged":[[27,3,27,5],[19,5,19,7],[46,3,46,5],[55,4,55,7],[3,4,6,7]]}
[]
[]
[null,null,null,null,"Disclaimer:"]
[null,null,null,null,{"$f":"Config!$A$36","v":"De in het TCO-Vracht gebruikte default- c.q. standaardwaarden zijn met de grootste zorg verzameld. Het betreft echter gemiddelde cijfers, de werkelijke cijfers kunnen ofwel hoger dan wel lager zijn. Hoewel veel zorg is besteed aan de correctheid van de rekenregels en de gebruikte inputdata, is Panteia of de Topsector Logistiek niet aansprakelijk te houden voor de juistheid van de rekenresultaten. "}]
[]
[]
[]
[]
[null,"Input-output module",null,null,"TCO-ZET-Vracht"," "]
[null,null,null,null,{"$f":"IF('Read Me'!$C$3=\"Nederlands\",_xlfn.CONCAT(\"versie \",Config!$B$1),_xlfn.CONCAT(\"version \",Config!$B$1))","v":"versie 6.2"},"2024-03-01"]
{"$rows_left_out":119}
{"sheet":"M3-TCO-laadplein","index":2,"n_rows":50,"n_cols":23,"rows_kept":50,"cut":false,"hidden":false,"merged":[[21,18,21,19],[31,7,32,10],[46,7,46,9],[27,18,27,19],[25,18,25,19],[24,18,24,19],[23,18,23,19],[22,18,22,19],[52,6,53,12],[31,18,31,19],[30,18,30,19],[29,18,29,19],[28,18,28,19],[17,1,17,2],[19,1,25,4],[15,1,15,2],[16,1,16,2],[34,6,35,12],[2,1,3,8],[2,9,3,13],[2,15,3,22],[5,2,6,8],[5,12,5,13],[5,14,7,14],[5,15,7,15],[5,16,7,16],[5,17,6,22],[6,10,7,10],[6,11,7,11],[6,12,7,12],[6,13,7,13],[5,9,5,11],[6,9,7,9]]}
[]
[]
[null,{"$f":"Config!$A$54","v":"Stap 1\nVul het verwachte aantal elektrische vrachtvoertuigen per type op uw vestiging in de huidige situatie en in de komende tien jaar (per 2 jaar). Houd hierbij rekening met het aantal voertuigen dat tegelijk zal opladen (waardoor tegelijkertijd een laadbehoefte ontstaat).\nBelangrijk: Het invullen van het totale wagenpark moet voor ieder jaar afzonderlijk gebeuren. Vul in de eerste kolom het huidige aantal e-voertuigen in dat u al heeft."},null,null,null,null,null,null,null,{"$f":"Config!$A$55","v":"Stap 2\nGeef het verwachte jaarkilometrage (per voertuigtype) van uw voertuigen op. Op basis hiervan is een gemiddelde per dag berekend. Als dit sterk afwijkt van uw maximale dagelijkse afstand, vul dan zelf deze waarde in (kolom [Maximum per dag]). Per voertuigtype is een inschatting gemaakt van het gemiddelde energieverbruik. Weet u het energieverbruik? Vul deze dan zelf in de kolom [Eigen input] in."},null,null,null,null,null,{"$f":"Config!$A$56","v":"Stap 3\nVul per voertuigtype de hoeveel tijd (uren) in dat de vrachtwagens per dag kunnen opladen. Op basis van de benodigde energievraag wordt de kleinst mogelijke laadpaal berekend. U kunt deze vervangen met een eigen keuze. Let op: u kunt alleen een laadpaal met een hoger vermogen kiezen."}]
[]
[]
[null,null,{"$f":"IF('Read Me'!$C$3=\"Nederlands\",\n\"Stel uw vloot samen\",\n\"set up your vehicle park\"\n)","v":"Stel uw vloot samen"},null,null,null,null,null,null,{"$f":"IF('Read Me'!$C$3=\"Nederlands\",\"Kilometrage [km]\",\"Mileage [km]\")","v":"Kilometrage [km]"},null,null,{"$f":"IF('Read Me'!$C$3=\"Nederlands\",\"Energie gebruik [kWh/km]\",\"Energy use [kWh/km]\")","v":"Energie gebruik [kWh/km]"},null,{"$f":"IF('Read Me'!$C$3=\"Nederlands\",\"Jaarlijks energie gebruik per voertuig [kWh]\",\"Yearly energy use per vehicle [kWh]\")","v":"Jaarlijks energie gebruik per voertuig [kWh]"},{"$f":"IF('Read Me'!$C$3=\"Nederlands\",\"Aantal uren per dag terug op depot\",\"Amount of hours on own location\")","v":"Aantal uren per dag terug op depot"},{"$f":"IF('Read Me'!$C$3=\"Nederlands\",\"Kleinst bruikbare laadpaal\",\"Least heavy charging station\")","v":"Kleinst bruikbare laadpaal"},{"$f":"IF('Read Me'!$C$3=\"Nederlands\",\"Minimaal aantal benodigde laadpalen in:\",\"Minimum charging stations needed in:\")","v":"Minimaal aantal benodigde laadpalen in:"}]
[null,null,null,null,null,null,null,null,null,{"$f":"IF('Read Me'!$C$3=\"Nederlands\",\"Jaarlijks per voertuig\",\"annually per vehicle\")","v":"Jaarlijks per voertuig"},{"$f":"IF('Read Me'!$C$3=\"Nederlands\",\"Gemiddeld per dag\",\"Daily average\")","v":"Gemiddeld per dag"},{"$f":"IF('Read Me'!$C$3=\"Nederlands\",\"Maximum per dag\",\"Daily max\")","v":"Maximum per dag"},{"$f":"IF('Read Me'!$C$3=\"Nederlands\",\"Advies\",\"Advice\")","v":"Advies"},{"$f":"IF('Read Me'!$C$3=\"Nederlands\",\"Eigen input\",\"Own input\")","v":"Eigen input"}]
[null,null,null,{"$f":"'Input-Output Module'!$D$20","v":2023},{"$f":"D8+2","v":2025},{"$f":"E8+2","v":2027},2029,2031,2033,null,null,null,null,null,null,null,null,{"$f":"D8","v":2023},{"$f":"E8","v":2025},2027,2029,2031,2033]
[null,null,"Bestelwagens (tot 3,5 ton)",0,{"$f":"$D$9","v":0},{"$f":"$E$9","v":0},{"$f":"$F$9","v":0},{"$f":"$G$9","v":0},{"$f":"$H$9","v":0},30000,{"$f":"J9/INDEX(InzetVoertuigPar[[#All],[Waarde]],MATCH(\"Productieve dagen per jaar\",InzetVoertuigPar[[#All],[Variabele]],0))","v":115.38461538461539},null,{"$f":"IF(C9=$C$9,0.3,INDEX(EnergieverbruikEnOnderhoudPerType[[#All],[Rijden EV '[kWh/km']]],MATCH('M3-TCO-laadplein'!B9,EnergieverbruikEnOnderhoudPerType[[#All],[Type ID]],0)))","v":0.3},null,{"$f":"IF(N9<>\"\",N9,M9)*J9","v":9000},8,{"$f":"IFERROR(INDEX(LaadinfraPrivaat[[#All],[Charging type]],MATCH((IF($L$9>0,$L$9,$K$9)*IF($N$9>0,$N$9,$M$9))/$P$9,LaadinfraPrivaat[[#All],[Power (kW)]],-1)),Config!$A$57)","v":"AC11"},{"$f":"ROUNDUP((D9*(IF($L9<>\"\",$L9,$K9)*IF($N9<>\"\",$N9,$M9))/$P9)/INDEX(LaadinfraPrivaat[[#All],[Power (kW)]],MATCH('M3-TCO-laadplein'!Q9,LaadinfraPrivaat[[#All],[Charging type]],0)),0)","v":0},{"$f":"ROUNDUP((E9*(IF($L9<>\"\",$L9,$K9)*IF($N9<>\"\",$N9,$M9))/$P9)/INDEX(LaadinfraPrivaat[[#All],[Power (kW)]],MATCH('M3-TCO-laadplein'!Q9,LaadinfraPrivaat[[#All],[Charging type]],0)),0)","v":0},{"$f":"ROUNDUP((F9*(IF($L9<>\"\",$L9,$K9)*IF($N9<>\"\",$N9,$M9))/$P9)/INDEX(LaadinfraPrivaat[[#All],[Power (kW)]],MATCH('M3-TCO-laadplein'!Q9,LaadinfraPrivaat[[#All],[Charging type]],0)),0)","v":0},{"$f":"ROUNDUP((G9*(IF($L9<>\"\",$L9,$K9)*IF($N9<>\"\",$N9,$M9))/$P9)/INDEX(LaadinfraPrivaat[[#All],[Power (kW)]],MATCH('M3-TCO-laadplein'!Q9,LaadinfraPrivaat[[#All],[Charging type]],0)),0)","v":0},{"$f":"ROUNDUP((H9*(IF($L9<>\"\",$L9,$K9)*IF($N9<>\"\",$N9,$M9))/$P9)/INDEX(LaadinfraPrivaat[[#All],[Power (kW)]],MATCH('M3-TCO-laadplein'!Q9,LaadinfraPrivaat[[#All],[Charging type]],0)),0)","v":0},{"$f":"ROUNDUP((I9*(IF($L9<>\"\",$L9,$K9)*IF($N9<>\"\",$N9,$M9))/$P9)/INDEX(LaadinfraPrivaat[[#All],[Power (kW)]],MATCH('M3-TCO-laadplein'!Q9,LaadinfraPrivaat[[#All],[Charging type]],0)),0)","v":0}]
[null,1,{"$f":"IF('Read Me'!$C$3=\"Nederlands\",\n\"Kleine bakwagen (lvm <12 ton)\",\n\"Small truck (load <12 tonnes)\"\n)","v":"Kleine bakwagen (lvm <12 ton)"},0,{"$f":"$D$10","v":0},{"$f":"$E$10","v":0},{"$f":"$F$10","v":0},{"$f":"$G$10","v":0},{"$f":"$H$10","v":0},{"$f":"INDEX(Voertuigen[[#All],[Kilometrage]],MATCH($B$10,Voertuigen[[#All],[Type ID]],0))","v":35000},{"$f":"J10/INDEX(InzetVoertuigPar[[#All],[Waarde]],MATCH(\"Productieve dagen per jaar\",InzetVoertuigPar[[#All],[Variabele]],0))","v":134.61538461538461},null,{"$f":"IF(C10=$C$9,0.3,INDEX(EnergieverbruikEnOnderhoudPerType[[#All],[Rijden EV '[kWh/km']]],MATCH('M3-TCO-laadplein'!B10,EnergieverbruikEnOnderhoudPerType[[#All],[Type ID]],0)))","v":0.48154113423076755},null,{"$f":"IF(N10<>\"\",N10,M10)*J10","v":16853.939698076865},8,{"$f":"IFERROR(INDEX(LaadinfraPrivaat[[#All],[Charging type]],MATCH((IF($L$10>0,$L$10,$K$10)*IF($N$10>0,$N$10,$M$10))/P10,LaadinfraPrivaat[[#All],[Power (kW)]],-1)),Config!$A$57)","v":"AC11"},{"$f":"ROUNDUP((D10*(IF($L10<>\"\",$L10,$K10)*IF($N10<>\"\",$N10,$M10))/$P10)/INDEX(LaadinfraPrivaat[[#All],[Power (kW)]],MATCH('M3-TCO-laadplein'!Q10,LaadinfraPrivaat[[#All],[Charging type]],0)),0)","v":0},{"$f":"ROUNDUP((E10*(IF($L10<>\"\",$L10,$K10)*IF($N10<>\"\",$N10,$M10))/$P10)/INDEX(LaadinfraPrivaat[[#All],[Power (kW)]],MATCH('M3-TCO-laadplein'!Q10,LaadinfraPrivaat[[#All],[Charging type]],0)),0)","v":0},{"$f":"ROUNDUP((F10*(IF($L10<>\"\",$L10,$K10)*IF($N10<>\"\",$N10,$M10))/$P10)/INDEX(LaadinfraPrivaat[[#All],[Power (kW)]],MATCH('M3-TCO-laadplein'!Q10,LaadinfraPrivaat[[#All],[Charging type]],0)),0)","v":0},{"$f":"ROUNDUP((G10*(IF($L10<>\"\",$L10,$K10)*IF($N10<>\"\",$N10,$M10))/$P10)/INDEX(LaadinfraPrivaat[[#All],[Power (kW)]],MATCH('M3-TCO-laadplein'!Q10,LaadinfraPrivaat[[#All],[Charging type]],0)),0)","v":0},{"$f":"ROUNDUP((H10*(IF($L10<>\"\",$L10,$K10)*IF($N10<>\"\",$N10,$M10))/$P10)/INDEX(LaadinfraPrivaat[[#All],[Power (kW)]],MATCH('M3-TCO-laadplein'!Q10,LaadinfraPrivaat[[#All],[Charging type]],0)),0)","v":0},{"$f":"ROUNDUP((I10*(IF($L10<>\"\",$L10,$K10)*IF($N10<>\"\",$N10,$M10))/$P10)/INDEX(LaadinfraPrivaat[[#All],[Power (kW)]],MATCH('M3-TCO-laadplein'!Q10,LaadinfraPrivaat[[#All],[Charging type]],0)),0)","v":0}]
{"$rows_left_out":41}
{"sheet":"Calculatie","index":3,"n_rows":56,"n_cols":25,"rows_kept":56,"cut":false,"hidden":false,"merged":[[14,1,14,4],[15,1,15,4]]}
["BASIS INVOERGEGEVENS"]
["Voertuig / ID",{"$f":"Voertuigtype","v":"Grote bakwagen (lvm > 16 ton)"},{"$f":"INDEX(Voertuigen[#All],MATCH(Calculatie!B2,Voertuigen[[#All],[Voertuig]],0),2)","v":5},null,null,"test","Dit is een overgenomen veld"]
["Voertuigtype / ID",{"$f":"INDEX(Voertuigen[#All],MATCH(Calculatie!B2,Voertuigen[[#All],[Voertuig]],0),3)","v":"Grote bakwagen"},{"$f":"INDEX(Voertuigen[#All],MATCH(Calculatie!B2,Voertuigen[[#All],[Voertuig]],0),4)","v":3},null,null,"test","Dit is een berekening"]
["Verwacht jaarkilometrage",{"$f":"Kilometrage","v":70000}]
["Grijze/groene elektriciciteit",{"$f":"Elec_type","v":"Groen"}]
["Grijze/groene waterstof",{"$f":"H2_type","v":"Electrolyse (hernieuwbare energie)"}]
["Rechtsvorm en belastingpercentage",{"$f":"Belasting","v":"BV of NV met 19% belasting"}]
["Grootte van bedrijf",{"$f":"Bedrijfsgrootte","v":"Groot"},null,null,null,null,null,null,null,null,"Berekeningen Laadpleinmodel"]
[null,null,null,null,null,null,null,null,null,null,"Aantal laadpalen en piekvermogen"]
["INZETGEGEVENS VOERTUIG SYSTEM","DV","EV","FC","H2ICE-CI",null,null,null,null,null,"Laadpaal","Vermogen [kW/u]","jaar 0","jaar 1-2","jaar 3-4","jaar 5-6","jaar 7-8","jaar 9-10","OPEX"]
{"$rows_left_out":47}
{"sheet":"M1-PowerSupply","index":4,"n_rows":51,"n_cols":14,"rows_kept":51,"cut":false,"hidden":false,"merged":[]}
["BASIS INVOERGEGEVENS"]
["Voertuig / ID",{"$f":"Voertuigtype","v":"Grote bakwagen (lvm > 16 ton)"},{"$f":"INDEX(Voertuigen[#All],MATCH(Calculatie!B2,Voertuigen[[#All],[Voertuig]],0),2)","v":5},null,null,"test","Dit is een overgenomen veld"]
["Voertuigtype / ID",{"$f":"INDEX(Voertuigen[#All],MATCH(Calculatie!B2,Voertuigen[[#All],[Voertuig]],0),3)","v":"Grote bakwagen"},{"$f":"INDEX(Voertuigen[#All],MATCH(Calculatie!B2,Voertuigen[[#All],[Voertuig]],0),4)","v":3},null,null,"test","Dit is een berekening"]
["Verwacht jaarkilometrage",{"$f":"Kilometrage","v":70000}]
["Grijze/groene elektriciciteit",{"$f":"Elec_type","v":"Groen"}]
["Grijze/groene waterstof",{"$f":"H2_type","v":"Electrolyse (hernieuwbare energie)"}]
["Rechtsvorm en belastingpercentage",{"$f":"Belasting","v":"BV of NV met 19% belasting"}]
["Grootte van bedrijf",{"$f":"Bedrijfsgrootte","v":"Groot"}]
["Gekoeld?",{"$f":"Koeling","v":"Nee"}]
["Km/dag",{"$f":"Calculatie!B16","v":269.23076923076923}]
{"$rows_left_out":42}
{"sheet":"M2-Subsidie","index":5,"n_rows":42,"n_cols":13,"rows_kept":42,"cut":false,"hidden":false,"merged":[]}
[]
["Samenvatting gegevens"]
["Voertuigtype",{"$f":"Calculatie!$B$3","v":"Grote bakwagen"},null,null,null,"Parameters"]
["Voertuigtype ID",{"$f":"Calculatie!$C$3","v":3},null,null,null,"Maximale steun per categorie",null,null,null,null,"Percentage en investering per jaar"]
["Voertuig categorie",{"$f":"INDEX(AanzetCAT[#All],$B$4+1,2)","v":"N3 Bakwagen (lvm > 18t)"},null,null,null,"AanZET categorie","Omvang bedrijf","Max. steun [%]","Max. steun [€]",null,"Jaartal","MIA %","Min. Investering"]
["Rechtsvorm en belastingpercentage",{"$f":"INDEX(Belastinggegevens[[#All],[Belastingsklasse]],MATCH(Calculatie!$B$7,Keuzevelden[[#All],[Rechtsvorm en belastingpercentage]],0))","v":"BV of NV met 19% belasting"},null,null,null,"N2","Middelgroot",0.12,14700,null,2021,0.36,2500]
["Basisjaar prognose",{"$f":"MIN(YEAR(NOW()),MAX(MIAperJaar[[#All],[Jaartal]]))","v":2023},null,null,null,"N2","Klein",0.14799999999999999,18800,null,2022,0.45,2500]
["Grootte van bedrijf",{"$f":"INDEX(MaxStaatsSteun[[#All],[Omvang bedrijf]],MATCH(Calculatie!$B$8,Keuzevelden[[#All],[Grootte van bedrijf]],0))","v":"Groot"},null,null,null,"N2","Groot",6.0999999999999999E-2,7500,null,2023,0.36,2500]
["Minimale investering",{"$f":"INDEX(MIAperJaar[[#All],[Min. Investering]],MATCH($B$7,MIAperJaar[[#All],[Jaartal]],0))","v":2500},null,null,null,"N3 Bakwagen (lvm <= 18t)","Middelgroot",0.2,60500]
[null,null,null,null,null,"N3 Bakwagen (lvm <= 18t)","Klein",0.28599999999999998,86600]
{"$rows_left_out":33}
{"sheet":"Invoer en categorieën","index":6,"n_rows":80,"n_cols":20,"rows_kept":80,"cut":false,"hidden":false,"merged":[]}
[]
[null,"Voertuigen en kenmerken",null,null,null,null,null,null,null,null,null,null,null,null,"Opties keuzevelden en defaultwaarden"]
[null,"Basisjaar financiële cijfers:",2023,"(relevant voor indexatie)"]
[null,"Voertuig","Voertuig ID","Type","Type ID","Casco kosten voertuig (DV)","H2ICE Casco","Aanschaf koelsysteem","Kilometrage","Productive uren per jaar","Afschrijftermijn","Uurloon",null,null,"Optie","Grijze/groene elektriciciteit","Grijze/groene waterstof","Rechtsvorm en belastingpercentage","Grootte van bedrijf"]
[null,{"$f":"Config!A37","v":"Kleine bakwagen (lvm ca. 6 ton)"},1,{"$f":"Config!A47","v":"Kleine bakwagen"},1,81937.5,0,17500,35000,2600,7,31.48,null,null,"keuze 1",{"$f":"Config!$A$15","v":"Grijs"},{"$f":"Config!$A$15","v":"Grijs"},{"$f":"Config!$A$20","v":"BV of NV met 19% belasting"},{"$f":"Config!$A$26","v":"Groot"}]
[null,{"$f":"Config!A38","v":"Kleine bakwagen/ Verhuiswagen"},2,{"$f":"Config!A47","v":"Kleine bakwagen"},1,66120,0,0,35000,1600,5,24.7,null,null,"keuze 2",{"$f":"Config!$A$16","v":"Groen"},{"$f":"Config!$A$17","v":"Blauw"},{"$f":"Config!$A$21","v":"BV of NV met 25,8% belasting"},{"$f":"Config!$A$25","v":"Middelgroot"}]
[null,{"$f":"Config!A39","v":"Medium bakwagen (lvm ca. 9 ton)"},3,{"$f":"Config!A48","v":"Medium bakwagen"},2,116351.24999999997,0,20000,70000,2600,7,31.48,null,null,"keuze 3",null,{"$f":"Config!$A$18","v":"Electrolyse (netstroom)"},{"$f":"Config!$A$22","v":"Eenmanszaak met 36,93% belasting"},{"$f":"Config!$A$24","v":"Klein"}]
[null,{"$f":"Config!A40","v":"Medium bakwagen/ Verhuiswagen"},4,{"$f":"Config!A48","v":"Medium bakwagen"},2,129959.99999999999,0,0,30000,1800,8,29.5,null,null,"keuze 4",null,{"$f":"Config!$A$19","v":"Electrolyse (hernieuwbare energie)"},{"$f":"Config!$A$23","v":"Eenmanszaak met 49,5% belasting"}]
[null,{"$f":"Config!A41","v":"Grote bakwagen (lvm > 16 ton)"},5,{"$f":"Config!A49","v":"Grote bakwagen"},3,150765,0,22500,70000,2600,7,31.48,null,null,"keuze 5"]
[null,{"$f":"Config!A42","v":"Grote bakwagen/ Verhuiswagen"},6,{"$f":"Config!A49","v":"Grote bakwagen"},3,150480,0,0,47000,2000,11,28.9,null,null,"keuze 6"]
{"$rows_left_out":71}
{"sheet":"Parameters","index":7,"n_rows":54,"n_cols":11,"rows_kept":54,"cut":false,"hidden":false,"merged":[]}
[]
[null,"Energieprijzen",null,null,null,null,null,"HERNIEUWBARE ENERGIE-EENHEDEN (HEB's)"]
[null,"Item","Variabele","Waarde","toelichting",null,null,"Variabele","Waarde","toelichting"]
[null,"Dieselprijs","Literprijs",1.03,"Kale prijs diesel per liter",null,null,"Multiplier EV",4]
[null,"Dieselprijs","Accijns",0.51619999999999999,"Accijns diesel per liter",null,null,"Multiplier FC",2.5]
[null,"Elektriciteitsprijs","kWh",0.122072892561983,"inkoopprijs stroom per kWh",null,null,"Aandeel groene energie 'grijze' stroom",0.26400000000000001]
[null,"Waterstofprijs",{"$f":"Config!$A$15","v":"Grijs"},7.56,"Inkoopprijs grijze waterstof per liter",null,null,"Waarde HBE",12]
[null,"Waterstofprijs",{"$f":"Config!$A$17","v":"Blauw"},8.06,"Inkoopprijs blauwe waterstof per liter",null,null,"Energiewaarde (MJ) per kg H2",120.1]
[null,"Waterstofprijs",{"$f":"Config!$A$18","v":"Electrolyse (netstroom)"},10,"Inkoopprijs waterstof per liter",null,null,"Vaste kosten registratie (per jaar)",2000]
[null,"Waterstofprijs",{"$f":"Config!$A$19","v":"Electrolyse (hernieuwbare energie)"},19,"Inkoopprijs waterstof per liter"]
{"$rows_left_out":45}
{"sheet":"Laadpleinkosten","index":8,"n_rows":119,"n_cols":16,"rows_kept":119,"cut":false,"hidden":false,"merged":[]}
["Basis"]
["TCO-ZET-Vracht"]
["Index","Charging type","Power","Land type","Column1","Power (kW)","Depth of discharge (%)","Efficiency (%)","Column2","Column3","Installation costs (€)","Operational costs annual (€)","Own energy costs (€)","External energy costs (€)"]
[1,"AC3,7","3,7 kW","Privaat",null,3.7,0.8,0.85799999999999998,null,null,270,25,0.20500000000000002,{"$f":"Charging_system_table1114[[#This Row],[Own energy costs (€)]]","v":0.20500000000000002}]
[2,"AC10","10 kW","Publiek",null,10,0.8,0.90200000000000002,null,null,1620,600,null,0.30759999999999998]
[3,"AC20","20 kW","Publiek",null,20,0.8,0.90200000000000002,null,null,1620,1295,null,0.4466]
[4,"AC20","20 kW","Privaat",null,20,0.8,0.90200000000000002,null,null,620,165,0.13,{"$f":"Charging_system_table1114[[#This Row],[Own energy costs (€)]]","v":0.13}]
[5,"FC50","50 kW","Publiek",null,50,0.7,0.88700000000000001,null,null,6500,3687.5,null,0.2631444444444444]
[6,"FC50","50 kW","Privaat",null,50,0.7,0.88700000000000001,null,null,4000,2812.5,0.12,{"$f":"Charging_system_table1114[[#This Row],[Own energy costs (€)]]","v":0.12}]
[7,"HPC150","150 kW","Publiek",null,150,0.7,0.88700000000000001,null,null,11625,7962.5,null,0.25870000000000004]
{"$rows_left_out":110}
{"sheet":"Config","index":9,"n_rows":72,"n_cols":17,"rows_kept":72,"cut":false,"hidden":false,"merged":[[8,0,8,2]]}
["Versie","6.2"]
[]
[]
[]
[]
[]
[]
[]
["Invoervelden",null,null,null,null,null,null,null,"Formatteren subsidie-waarden"]
["Lan","Dutch","English",null,null,null,null,null,null,"EV","FC","h2ICE"]
{"$rows_left_out":62}