{"text_format":"1","workbook":"xlsx","n_sheets":17,"sheets":["Read Me","Input-Output Module","Vergelijking Data","Chart1","Chart2","Invoervelden","Catalogus","Calculatie","M1-PowerSupply","M2-Subsidie","Indexatie","Parameters","Database","Dynamic","Breakeven analyse","Laadpleinkosten","Config"],"not_rendered":{"charts":4,"images":2,"macros":1,"external_links":2,"defined_names":78,"comments":0,"pivot_tables":0},"unopened":[{"sheet":"Chart1","index":3,"reason":"not_a_worksheet"},{"sheet":"Chart2","index":4,"reason":"not_a_worksheet"}],"bounds":{"document_bytes":16777216,"sheet_cells":100000,"rows_first":2000,"rows_last":500,"rows_between":2000,"halvings":0,"cell_chars":16384,"cell_head_chars":4096},"cells_cut":0,"cells_raw":0,"read":"whole","date_system":"1900"}

{"sheet":"Read Me","index":0,"n_rows":24,"n_cols":4,"rows_kept":24,"cut":false,"hidden":false,"merged":[]}
["Taal/Language:","Nederlands"]
[]
[null,null,null,{"$f":"+Config!B124","v":"Voorwoord"}]
[null,null,null,{"$f":"+Config!B125","v":"Het kostprijsmodel “TCO-ZET-Vracht” is in opdracht van Topsector Logistiek en het Ministerie van I&W door Panteia gebouwd en wordt door haar vervolgens onderhouden. Bij de ontwikkeling van dit TCO-model is gekozen voor een open en transparante opzet. Dit betekent dat helder is welke rekenregels zijn toegepast en welke waarde van de default data als uitgangswaarde is gehanteerd. Het TCO-model wordt mede onderschreven door RAI, evofenedex en TLN."}]
[]
[null,null,null,{"$f":"+Config!B126","v":"Nieuw in TCO-ZET-Vracht versie 5.0 (d.d. 19-5-2023):"}]
{"$rows_left_out":19}
{"sheet":"Input-Output Module","index":1,"n_rows":120,"n_cols":9,"rows_kept":120,"cut":false,"hidden":false,"merged":[[4,2,7,4],[9,5,10,5],[9,6,10,6],[40,6,40,7]]}
[]
[]
[]
[null,null,"Disclaimer:"]
[null,null,{"$f":"Config!B123","v":"De in het TCO-Vracht gebruikte default- c.q. standaardwaarden zijn met de grootste zorg verzameld. Het betreft echter gemiddelde cijfers, de werkelijke cijfers kunnen ofwel hoger dan wel lager zijn. Hoewel veel zorg is besteed aan de correctheid van de rekenregels en de gebruikte inputdata, is Panteia of de Topsector Logistiek niet aansprakelijk te houden voor de juistheid van de rekenresultaten. "}]
[]
{"$rows_left_out":115}
{"sheet":"Vergelijking Data","index":2,"n_rows":47,"n_cols":11,"rows_kept":47,"cut":false,"hidden":false,"merged":[[2,2,2,5]]}
[null,null,null,null,null,null,null,null,"Datasetnaam"]
[null,null,null,null,null,null,null,null,"kleine bakwagen 2023"]
[null,null,{"$f":"+Config!$B$198","v":"Vergelijking Data"},null,null,null,null,null,"medium bakwagen 2023"]
[null,null,null,null,null,null,null,null,"grote bakwagen 2023"]
[null,null,{"$f":"+Config!$B$199","v":"Selecteer DataSet"},"zware trekker 2023","zware trekker 2023","zware trekker 2023",null,null,"lichte trekker 2023"]
[null,null,{"$f":"+Config!$B$200","v":"Voertuigscenario"},"Diesel","Elektrisch","Waterstof",null,null,"zware trekker 2023"]
{"$rows_left_out":42}
{"sheet":"Invoervelden","index":5,"n_rows":23,"n_cols":9,"rows_kept":23,"cut":false,"hidden":false,"merged":[]}
["Optie","Voertuigtype","Koelmachine (J/N)","Verwacht jaarkilometrage","Grijze/groene elektriciciteit","Grijze/groene waterstof","Rechtsvorm en belastingpercentage","Basisjaar prognose","Grootte van bedrijf"]
[{"$f":"+Config!B157","v":"Defaultwaarde"},null,{"$f":"+Config!B178","v":"niet gekoeld"},null,{"$f":"+Config!B186","v":"Groen"},{"$f":"F6","v":"Electrolyse (hernieuwbare energie)"},{"$f":"+Config!B187","v":"BV of NV met 19% belasting"},2022,{"$f":"+Config!B188","v":"Groot"}]
[{"$f":"+Config!B158","v":"keuze 1"},{"$f":"+Config!B173","v":"Kleine bakwagen (lvm ca. 6 ton)"},{"$f":"IFERROR(IF(Calculatie!$B$3>=4,Config!$B$178,Config!$B$179),Config!$B$179)","v":"gekoeld"},35000,{"$f":"+Config!B6","v":"Grijs"},{"$f":"Config!B6","v":"Grijs"},{"$f":"+Config!B187","v":"BV of NV met 19% belasting"},null,{"$f":"+Config!B188","v":"Groot"}]
[{"$f":"+Config!B159","v":"keuze 2"},{"$f":"+Config!B174","v":"Medium bakwagen (lvm ca. 9 ton)"},{"$f":"IFERROR(IF(Calculatie!$B$3>=4,\"\",Config!$B$178),Config!$B$178)","v":"niet gekoeld"},70000,{"$f":"+Config!B186","v":"Groen"},{"$f":"Config!B7","v":"Blauw"},{"$f":"+Config!B180","v":"BV of NV met 25,8% belasting"},null,{"$f":"+Config!B183","v":"Middelgroot"}]
[{"$f":"+Config!B160","v":"keuze 3"},{"$f":"+Config!B175","v":"Grote bakwagen (lvm > 16 ton)"},null,70000,null,{"$f":"Config!B8","v":"Electrolyse (netstroom)"},{"$f":"+Config!B181","v":"Eenmanszaak met 36,93% belasting"},null,{"$f":"+Config!B184","v":"Klein"}]
[{"$f":"+Config!B161","v":"keuze 4"},{"$f":"+Config!B176","v":"Lichte trekker z/opl (GVW <40 ton)"},null,100000,null,{"$f":"Config!B9","v":"Electrolyse (hernieuwbare energie)"},{"$f":"+Config!B182","v":"Eenmanszaak met 49,5% belasting"}]
{"$rows_left_out":18}
{"sheet":"Catalogus","index":6,"n_rows":57,"n_cols":21,"rows_kept":57,"cut":false,"hidden":false,"merged":[]}
["Onderstaande tabel bevat alle voertuigvarianten en kenmerken"]
["ID","Veh. Type","Veh. Type ID","Fuel","Variant ID","Name","Energy unit","Veh. Price","Energy/fuel consumption L; kWh; kg H2","Refrigeration energy/fuel consumption L; kWh; kg H2","Maintenance costs","Road tax","Tolheffing","Battery size","FC power","H2 Storage tanks","Jaarlijkse reparaties","Koeling"]
[1,{"$f":"Config!B190","v":"Kleine bakwagen"},1,"DV",1,{"$f":"+VehicleCatalogus[[#This Row],[Veh. Type]]","v":"Kleine bakwagen"},"L",{"$f":"VLOOKUP(VehicleCatalogus[[#This Row],[Name]],Indexatie!$C:$D,2,FALSE)","v":81937.5},0.1023274910240381,1,5.2364500000000008E-2,315.89999999999998,0,null,null,null,500,{"$f":"IFERROR(INDEX(Indexatie!$E:$E,MATCH(CONCATENATE(Config!$B$245,\" \",VehicleCatalogus[[#This Row],[Veh. Type]]),Indexatie!$C:$C,0)),0)","v":17500}]
[2,{"$f":"+Config!B191","v":"Medium bakwagen"},2,"DV",1,{"$f":"+VehicleCatalogus[[#This Row],[Veh. Type]]","v":"Medium bakwagen"},"L",{"$f":"VLOOKUP(VehicleCatalogus[[#This Row],[Name]],Indexatie!$C:$D,2,FALSE)","v":116351.24999999997},0.20136262941514174,1.5,5.7599150000000002E-2,315.89999999999998,0,null,null,null,500,{"$f":"IFERROR(INDEX(Indexatie!$E:$E,MATCH(CONCATENATE(Config!$B$245,\" \",VehicleCatalogus[[#This Row],[Veh. Type]]),Indexatie!$C:$C,0)),0)","v":20000}]
[3,{"$f":"Config!B192","v":"Grote bakwagen"},3,"DV",1,{"$f":"+VehicleCatalogus[[#This Row],[Veh. Type]]","v":"Grote bakwagen"},"L",{"$f":"VLOOKUP(VehicleCatalogus[[#This Row],[Name]],Indexatie!$C:$D,2,FALSE)","v":150765},0.28541791164119135,2.5,6.2833799999999995E-2,315.89999999999998,0,null,null,null,1000,{"$f":"IFERROR(INDEX(Indexatie!$E:$E,MATCH(CONCATENATE(Config!$B$245,\" \",VehicleCatalogus[[#This Row],[Veh. Type]]),Indexatie!$C:$C,0)),0)","v":22500}]
[4,{"$f":"+Config!B193","v":"Lichte trekker z/opl"},4,"DV",1,{"$f":"+VehicleCatalogus[[#This Row],[Veh. Type]]","v":"Lichte trekker z/opl"},"L",{"$f":"VLOOKUP(VehicleCatalogus[[#This Row],[Name]],Indexatie!$C:$D,2,FALSE)","v":124872.74999999997},0.29566505637688012,0,7.3295699999999991E-2,851.60879999999997,0,null,null,null,1500,{"$f":"IFERROR(INDEX(Indexatie!$E:$E,MATCH(CONCATENATE(Config!$B$245,\" \",VehicleCatalogus[[#This Row],[Veh. Type]]),Indexatie!$C:$C,0)),0)","v":0}]
{"$rows_left_out":52}
{"sheet":"Calculatie","index":7,"n_rows":107,"n_cols":7,"rows_kept":107,"cut":false,"hidden":false,"merged":[]}
["BASIS INVOERGEGEVENS"]
["Voertuigtype",{"$f":"LEFT(C2,FIND(\"(\",C2)-2)","v":"Kleine bakwagen"},{"$f":"voertuigtype_input","v":"Kleine bakwagen (lvm ca. 6 ton)"},null,null,"test","Dit is een overgenomen veld"]
["Voertuig type ID",{"$f":"INDEX(VehicleCatalogus[#All],MATCH($B$2,VehicleCatalogus[[#All],[Veh. Type]],0),3)","v":1},null,null,null,"test","Dit is een berekening"]
["Koelmachine (J/N)",{"$f":"koelmachine","v":"niet gekoeld"}]
["Verwacht jaarkilometrage",{"$f":"DV_mileage","v":35000},{"$f":"IFERROR(INDEX(Invoervelden!$D$3:$D$17,MATCH(Calculatie!$C$2,Invoervelden!$B$3:$B$7,0)),30000)","v":35000}]
["Grijze/groene elektriciciteit",{"$f":"Electricity_type","v":"Groen"}]
{"$rows_left_out":102}
{"sheet":"M1-PowerSupply","index":8,"n_rows":57,"n_cols":8,"rows_kept":57,"cut":false,"hidden":false,"merged":[]}
["Berekening benodigde hoeveelheid energie per aandrijfvorm en bepalen aangeraden voertuigvariant"]
["Gekozen voertuigtype",{"$f":"Calculatie!B2","v":"Kleine bakwagen"}]
["Voertuig type ID",{"$f":"INDEX(VehicleCatalogus[#All],MATCH('M1-PowerSupply'!$B$2,VehicleCatalogus[[#All],[Veh. Type]],0),3)","v":1}]
["Koelmachine (J/N)",{"$f":"Calculatie!B4","v":"niet gekoeld"}]
["Kilometers / dag",{"$f":"Calculatie!B19","v":134.61538461538461},null,null,null,null,null,"De benodigde hoeveelheid energie is berekend per type aandrijving"]
["Productieve uren per dag",{"$f":"Calculatie!B18","v":10},null,null,null,null,null,"Per type aandrijving is een coefficient bekend (zie voertuigcatalogus) voor de benodige hoeveelheid energie per km en per uur (voor koeleenheid)"]
{"$rows_left_out":52}
{"sheet":"M2-Subsidie","index":9,"n_rows":57,"n_cols":11,"rows_kept":57,"cut":false,"hidden":false,"merged":[]}
["Parameters"]
["Maximale steun op grond van EU-staatssteunkalender"]
["Omvang bedrijf","Maximale steun (% van meerprijs)","Toelichting",null,null,null,null,"Maximale steun per categorie"]
[{"$f":"+Config!B188","v":"Groot"},0.4,">250 fte, >€50 mil omzet",null,null,null,null,"AanZET categorie","Omvang bedrijf","Max. steun [%]","Max. steun [€]"]
[{"$f":"+Config!B183","v":"Middelgroot"},0.5,"<250 fte, <€50 mil omzet",null,null,null,null,"N2",{"$f":"+Config!B188","v":"Groot"},0.125,17800]
[{"$f":"+Config!B184","v":"Klein"},0.6,"<50 fte, <€10 mil omzet",null,null,null,null,"N3 Bakwagen (lvm <= 18t)",{"$f":"+Config!B188","v":"Groot"},0.15,43600]
{"$rows_left_out":52}
{"sheet":"Indexatie","index":10,"n_rows":51,"n_cols":15,"rows_kept":51,"cut":false,"hidden":false,"merged":[[0,4,0,12]]}
["GEÏNDEXEERDE COËFFICIËNTEN",null,null,null,"Indices"]
["Categorie","Subcategorie","Coëfficiënt","Gebruikte waarde","grondvoet",2022,2023,2024,2025,2026,2027,2028,2029,2030,"Toelichting"]
["Basisjaar","Basisjaar","Basisjaar",{"$f":"'Input-Output Module'!B20","v":2023},null,{"$f":"IF($D$3>=F2,1,0)","v":1},1,0,0,0,0,0,0,0]
["Energieprijs","Diesel",{"$f":"+Config!B195","v":"Dieselprijs (ex btw en accijns)"},{"$f":"E4*IF(F4*F$3>0,F4,1)*IF(G4*G$3>0,G4,1)*IF(H4*H$3>0,H4,1)*IF(I4*I$3>0,I4,1)*IF(J4*J$3>0,J4,1)*IF(K4*K$3>0,K4,1)*IF(L4*L$3>0,L4,1)*IF(M4*M$3>0,M4,1)*IF(N4*N$3>0,N4,1)","v":1.08},1.5,1,0.72]
["Energieprijs","Diesel",{"$f":"+Config!B44","v":"Dieselaccijns"},0.46689999999999993,0.42,1,1.1116666666666666]
["Energieprijs","Waterstof",{"$f":"Config!B6","v":"Grijs"},7.56,7.56,1,1]
{"$rows_left_out":46}
{"sheet":"Parameters","index":11,"n_rows":93,"n_cols":8,"rows_kept":93,"cut":false,"hidden":false,"merged":[]}
["INZETGEGEVENS VOERTUIG SYSTEM",2023]
["Productieve dagen per jaar",260]
["Max. tijd per dag opladen extern",1]
["Max. aantal sessies per dag opladen extern",1]
[]
["ENERGIE EN EMISSIE GEGEVENS VOERTUIGEN"]
{"$rows_left_out":88}
{"sheet":"Database","index":12,"n_rows":16,"n_cols":104,"rows_kept":16,"cut":false,"hidden":false,"merged":[]}
["Datasetnaam",{"$f":"Config!$B$200","v":"Voertuigscenario"},{"$f":"Config!$B$204","v":"Creatiedatum"},{"$f":"Config!$B$205","v":"Voertuigtype"},{"$f":"Config!$B$206","v":"Koelmachine (J/N)"},{"$f":"Config!$B$207","v":"Verwacht jaarkilometrage"},{"$f":"Config!$B$208","v":"Grijze/groene elektriciciteit"},{"$f":"Config!$B$209","v":"Grijze/groene waterstof"},{"$f":"Config!$B$210","v":"Rechtsvorm en belastingpercentage"},{"$f":"Config!$B$211","v":"Jaar prognose"},{"$f":"Config!$B$212","v":"Economische levensduur "},{"$f":"Config!$B$214","v":"Productieve uren per jaar"},{"$f":"Config!$B$215","v":"Kosten van reparaties"},{"$f":"Config!$B$218","v":"Capaciteit vrachtwagenbatterij (kWh) "},{"$f":"Config!$B$220","v":"Bruto aankoopprijs "},{"$f":"Config!$B$221","v":"Subsidies"},{"$f":"Config!$B$222","v":"Netto aankoopprijs"},{"$f":"Config!$B$224","v":"Basisprijs energie"},{"$f":"Config!$B$213","v":"Restwaarde "},{"$f":"Config!$B$216","v":"Stilstand dagen per jaar"},{"$f":"Config!B217","v":"Vermogen eigen oplaadsysteem (kW)"},{"$f":"Config!B219","v":"Waterstof opslag tank (kg)"},{"$f":"Config!$B$223","v":"Netto kosten inkoop & aanleg oplaadsysteem"},{"$f":"Config!$B$44","v":"Dieselaccijns"},{"$f":"Config!$B$46","v":"Meerprijs tolheffing"},{"$f":"Config!$B$47","v":"Aandeel snelweg kilometers"},{"$f":"Config!$B$48","v":"Vaste ZE-Voertuigheffing"},{"$f":"Config!$B$49","v":"CO2 prijs"},{"$f":"Config!$B$226","v":"Scenario"},{"$f":"Config!$B$227","v":"Scenario validiteit"},"Column1",{"$f":"Config!$B$228","v":"Voertuig"},{"$f":"Config!B229","v":"Eigen oplaadsysteem"},{"$f":"Config!$B$230","v":"Openbaar oplaadsysteem"},"Column3",{"$f":"Config!$B$231","v":"Percentage eigen oplaadsysteem"},{"$f":"Config!$B$232","v":"Percentage extern (openbaar) Oplaadsysteem"},"Column4",{"$f":"Config!$B$233","v":"Totale kosten per jaar"},{"$f":"Config!$B$234","v":"Totale kosten per km"},{"$f":"Config!$B$235","v":"Totale kosten per uur"},"Column5",{"$f":"Config!$B$239","v":"Emissies (totaal per jaar voor het geselecteerde voertuig)"},{"$f":"Config!$B$240","v":"CO2 emissies (ton per jaar, WtW)"},{"$f":"Config!$B$241","v":"PM totaal (kg per jaar, TtW)"},{"$f":"Config!$B$242","v":"NOx (kg per jaar, TtW)"},"Column6","Column7","ONDERBOUWING KOSTENBEREKENING","Vaste kosten per jaar","Wegenbelasting","Eurovignet","Rente","Verzekering","Voertuigheffing","Diverse overige voertuigkosten","a: Totale vaste voertuigkosten per jaar","Fixed transport costs","Variabele kosten per jaar","Afschrijving voertuig","Brandstofverbruik voertuig","Brandstofverbruik koeling","Elektriciteitsverbruik","H2 verbruik","Adblue verbruik","Banden","Onderhoud","Reparatie","Reparatie/onderhoud koelunit","Verschil Tolheffing (km-tarief)","CO2-prijs","Hernieuwbare Brandstof-Eenheden","Specifieke vervoerskosten ","b: Totale variabele voertuigkosten per jaar","Repair, maintenance & tires","Kosten oplaadsysteem per jaar","Aankoop en installatie","Operationele kosten","c: Totale kosten oplaadsysteem per jaar",null,"Totale voertuig en oplaadsysteemkosten per jaar (a+b+c) ","Totale voertuig en oplaadsysteemkosten per km: (a+b+c)/kms per jaar","Totale voertuig en oplaadsysteemkosten per uur (a+b+c)/uren per jaar",null,"Chauffeurskosten","Uurloon incl. sociale lasten","Verblijfkostenvergoeding","Overige kosten","d: Totale chauffeurskosten per jaar",null,"Totale directe kosten per jaar (a+b+c+d)","Totale directe kosten per km: (a+b+c+d)/kms per jaar","Totale directe kosten per uur (a+b+c+d)/uren per jaar",null,"Algemene kosten (overhead)","Loon incl. sociale lasten","Huisvesting","Overig","e: Totale overhead per jaar",{"$f":"Config!$B$236","v":"HBE Toepassen (J/N)"},{"$f":"Config!$B$237","v":"Aantal HBE's"},"Forfait","Waarde per HBE",{"$f":"Config!$B$238","v":"Totale waarde HBE's"}]
["kleine bakwagen 2023","Diesel",45048,"Kleine bakwagen (lvm ca. 6 ton)","niet gekoeld",35000,"Groen","Electrolyse (hernieuwbare energie)","BV of NV met 19% belasting",2023,7,2600,500,"nvt",81937.5,0,81937.5,1.55,18935.88,0,"nvt","nvt","nvt",0.47,0,0.75,0,0,"Diesel","n.v.t.",null,"Kleine bakwagen (lvm ca. 6 ton)","n.v.t.","n.v.t.",null,"n.v.t.","n.v.t.",null,129888.09790112569,3.7110885114607339,49.956960731202187,null,null,11.60094301803764,2.9874311513610174,16.474726054870136,null,null,null,null,315.89999999999998,750,2131.4452856390494,2784.8417189624997,0,73.791359999999997,6055.9783646015494,null,null,9000.2307725838418,5709.1667204429177,0,0,0,75.885286095783343,809.247075,1832.7575000000004,500,0,0,0,0,410.75625000000002,18338.04360412254,null,null,0,0,0,null,24394.02196872409,0.69697205624925973,9.3823161418169576,null,null,81847.999999999985,2522,1404,85773.999999999985,null,110168.02196872408,3.1476577705349738,42.372316141816952,null,null,10355.794065060063,3194.8726370929985,6169.4092302485487,19720.075932401611,"nvt"]
["kleine bakwagen 2023","Elektrisch",45048,"Kleine bakwagen (lvm ca. 6 ton)","niet gekoeld",35000,"Groen","Electrolyse (hernieuwbare energie)","BV of NV met 19% belasting",2023,7,2600,500,120,139606.20000000001,0,139606.20000000001,0.12,32263.21,0,22,"nvt",3639.06,0.47,0,0.75,0,0,"EV Optimale mix","Scenario valide",null,"Kleine bakwagen 120 kWh","AC22","AC10",null,1,0,null,137944.51022703917,3.9412717207725474,53.055580856553526,null,null,0,2.8422408240440538,"n.v.t.",null,null,null,null,0,750,3631.5847668769766,4744.8502820542799,0,73.791359999999997,9200.2264089312557,null,null,15334.712644192148,0,0,2120.1704986689278,0,0,809.247075,916.3787500000002,500,0,0,0,0,410.75625000000002,20091.265217861073,null,null,363.90600000000001,1571.8833121721998,1935.7893121721997,null,31227.28093896453,0.89220802682755795,12.010492668832512,null,null,81847.999999999985,2522,1404,85773.999999999985,null,117001.28093896451,3.3428937411132718,45.000492668832507,null,null,10998.120408262665,3393.0371472299712,6552.0717325820124,20943.229288074646,"N",242,1,12,904]
["kleine bakwagen 2023","Waterstof",45048,"Kleine bakwagen (lvm ca. 6 ton)","niet gekoeld",35000,"Groen","Electrolyse (hernieuwbare energie)","BV of NV met 19% belasting",2023,7,2600,1500,70,257897.98,0,257897.98,10,59600.63,0,"nvt",15,"nvt",0.47,0,0.75,0,0,"Waterstof voertuig","n.v.t.",null,"Kleine bakwagen 30 kW","n.v.t.","n.v.t.",null,"n.v.t.","n.v.t.",null,173331.75232134247,4.9523357806097845,66.666058585131722,null,null,0,2.8422408240440538,"n.v.t.",null,null,null,null,0,750,6708.7162443361212,8765.279129511975,0,73.791359999999997,16297.786733848096,null,null,28328.193453346812,0,0,0,11146.785514601102,0,809.247075,2749.1362500000005,1500,0,0,0,0,410.75625000000002,44944.118542947916,null,null,0,0,0,null,61241.905276796009,1.7497687221941718,23.554578952613848,null,null,81847.999999999985,2522,1404,85773.999999999985,null,147015.90527679599,4.2004544364798857,56.544578952613847,null,null,13819.495096018823,4263.4612530270842,8232.890695500575,26315.847044546485,"N",334,1,12,2008]
["medium bakwagen 2023","Diesel",45048,"Medium bakwagen (lvm ca. 9 ton)","niet gekoeld",70000,"Groen","Electrolyse (hernieuwbare energie)","BV of NV met 19% belasting",2023,7,2600,500,"nvt",116351.25,0,116351.25,1.55,26888.959999999999,0,"nvt","nvt","nvt",0.47,0,0.75,0,0,"Diesel","n.v.t.",null,"Medium bakwagen (lvm ca. 9 ton)","n.v.t.","n.v.t.",null,"n.v.t.","n.v.t.",null,160194.22232547417,2.2884888903639169,61.613162432874681,null,null,45.657259186752313,6.2592770289873965,64.838766671675643,null,null,null,null,315.89999999999998,750,3026.6523056074493,3954.4752409267489,0,73.791359999999997,8120.8189065341985,null,null,12780.327697069049,22469.285840845016,0,0,0,203.6489186723465,1593.8389949999998,4031.9405000000002,500,0,0,0,0,399.10124999999999,41978.143201586405,null,null,0,0,0,null,50098.962108120606,0.71569945868743723,19.268831580046388,null,null,81847.999999999985,2522,1404,85773.999999999985,null,135872.96210812058,1.9410423158302941,52.258831580046376,null,null,12772.058438163334,3940.3159011354969,7608.8858780547525,24321.260217353585,"nvt"]
["medium bakwagen 2023","Elektrisch",45048,"Medium bakwagen (lvm ca. 9 ton)","niet gekoeld",70000,"Groen","Electrolyse (hernieuwbare energie)","BV of NV met 19% belasting",2023,7,2600,500,240,232200,0,232200,0.12,53661.78,0,50,"nvt",32104.04,0.47,0,0.75,0,0,"EV Optimale mix","Scenario valide",null,"Medium bakwagen 240 kWh","FC50","HPC150",null,0.65851345100695702,0.34148654899304298,null,187582.45400479675,2.6797493429256676,72.147097694152592,null,null,0,5.6844816480881075,"n.v.t.",null,null,null,null,0,750,6040.2330474494265,7891.8718186800006,0,73.791359999999997,14755.896226129425,null,null,25505.459470864596,0,0,15998.78900859122,0,0,1593.8389949999998,2015.9702500000001,500,0,0,0,0,399.10124999999999,46013.158974455815,null,null,3210.4034999999999,4367.7976014350006,7578.201101435001,null,68347.256302020236,0.97638937574314622,26.287406270007782,null,null,86601.735848759403,2668.4778835227648,1485.5443887652507,90755.758121047416,null,159103.01442306765,2.2729002060438237,61.193467085795248,null,null,14955.683355768359,4613.9874182689618,8909.7688076917893,28479.439581729108,"N",955,1,12,9460]
{"$rows_left_out":11}
{"sheet":"Dynamic","index":13,"n_rows":96,"n_cols":8,"rows_kept":96,"cut":false,"hidden":false,"merged":[]}
[null,null,null,"Jaarlijkse verandering (%)","Geaggregeerd"]
[null,"Diesel prijs",null,{"$f":"Parameters!B25","v":0.01},{"$f":"(1-(1+D2)^DV_age)/(1-(1+D2))/DV_age","v":1.0305050301001395}]
[]
[null,"Opladen","Aanschaf en installatie",{"$f":"Parameters!B26","v":1.6E-2}]
[null,null,"Operationele kosten",{"$f":"Parameters!B27","v":1.6E-2}]
[null,"Energie prijs","AC3,7",{"$f":"Parameters!B28","v":0.01},{"$f":"(1-(1+D6)^EV_age)/(1-(1+D6))/EV_age","v":1.0305050301001395}]
{"$rows_left_out":91}
{"sheet":"Breakeven analyse","index":14,"n_rows":150,"n_cols":21,"rows_kept":150,"cut":false,"hidden":false,"merged":[]}
[]
[]
[null,null,null,null,"1. Buy in Year 0 - which year will it become breakeven"]
[null,null,null,null,"2. Buy in Year x - which year will it become cheaper to buy EV"]
[]
[null,null,null,null,"Fleet prognosis - vans and trucks"]
{"$rows_left_out":145}
{"sheet":"Laadpleinkosten","index":15,"n_rows":119,"n_cols":16,"rows_kept":119,"cut":false,"hidden":false,"merged":[]}
["Basis"]
["TCO-ZET-Vracht"]
["Index","Charging type","Power","Land type","Column1","Power (kW)","Depth of discharge (%)","Efficiency (%)","Column2","Column3","Installation costs (€)","Operational costs annual (€)","Own energy costs (€)","External energy costs (€)"]
[1,"AC3,7","3,7 kW","Privaat",null,3.7,0.8,0.85799999999999998,null,null,270,25,0.20500000000000002,{"$f":"Charging_system_table1114[[#This Row],[Own energy costs (€)]]","v":0.20500000000000002}]
[2,"AC10","10 kW","Publiek",null,10,0.8,0.90200000000000002,null,null,1620,600,null,0.30759999999999998]
[3,"AC20","20 kW","Publiek",null,20,0.8,0.90200000000000002,null,null,1620,1295,null,0.4466]
{"$rows_left_out":114}
{"sheet":"Config","index":16,"n_rows":460,"n_cols":17,"rows_kept":460,"cut":false,"hidden":false,"merged":[]}
["Col. No",{"$f":"'Read Me'!B1","v":"Nederlands"},"Nederlands","English"]
[2,{"$f":"+HLOOKUP($B$1,$C$1:$D$505,$A2,0)","v":"J"},"J","Y",null,null,null,{"$f":"IF(Calculatie!$B$3>=4,Config!$B$3,Config!$B$2)","v":"J"},null,null,null,null,null,null,"DV","EV","FC"]
[{"$f":"+A2+1","v":3},"N","N","N",null,null,null,{"$f":"IF(Calculatie!$B$3>=4,\"\",Config!$B$3)","v":"N"},null,null,null,null,null,"Restwaarde",{"$f":"TEXT(Calculatie!B39,\"€#.##0,00\")","v":"€18.935,88"},{"$f":"TEXT(Calculatie!C39,\"€#.##0,00\")","v":"€32.263,21"},{"$f":"TEXT(Calculatie!D39,\"€#.##0,00\")","v":"€59.600,63"}]
[{"$f":"+A3+1","v":4},"Opslaan","Opslaan","Save",null,null,null,"Speciaal voor Koeling",null,null,null,null,null,"Vermogen eigen oplaadsysteem (kW)",null,{"$f":"CONCATENATE('M1-PowerSupply'!B36,\" kW/u\")","v":"22 kW/u"}]
[5,"Toegepaste waarde:","Toegepaste waarde:","Applied value:",null,null,null,null,null,null,null,null,null,"Capaciteit vrachtwagenbatterij (kWh) ",null,{"$f":"CONCATENATE(Calculatie!C26,\" kWh\")","v":"120 kWh"},{"$f":"CONCATENATE(Calculatie!D26,\" kWh\")","v":"70 kWh"}]
[6,"Grijs","Grijs","Gray",null,null,null,null,null,null,null,null,null,"Waterstof opslag tank (kg)",null,null,{"$f":"CONCATENATE(Calculatie!D32,\" kg\")","v":"15 kg"}]
{"$rows_left_out":454}