{"text_format":"1","workbook":"xlsx","n_sheets":17,"sheets":["Read Me","Input-Output Module","Vergelijking Data","Breakeven-analyse","Breakeven-analyse - bar","Invoervelden","Catalogus","Calculatie","M1-PowerSupply","M2-Subsidie","Parameters","Indexatie","Database","Dynamic","Breakeven analyse","kostenmodel laadplein2022","Config"],"not_rendered":{"charts":4,"images":2,"macros":1,"external_links":2,"defined_names":77,"comments":0,"pivot_tables":0},"unopened":[{"sheet":"Breakeven-analyse","index":3,"reason":"not_a_worksheet"},{"sheet":"Breakeven-analyse - bar","index":4,"reason":"not_a_worksheet"}],"bounds":{"document_bytes":16777216,"sheet_cells":100000,"rows_first":2000,"rows_last":500,"rows_between":2000,"halvings":0,"cell_chars":16384,"cell_head_chars":4096},"cells_cut":0,"cells_raw":0,"read":"whole","date_system":"1900"}

{"sheet":"Read Me","index":0,"n_rows":24,"n_cols":4,"rows_kept":24,"cut":false,"hidden":false,"merged":[]}
["Taal/Language:","Nederlands"]
[]
[null,null,null,{"$f":"+Config!B124","v":"Voorwoord"}]
[null,null,null,{"$f":"+Config!B125","v":"Het kostprijsmodel “TCO-ZET-Vracht” is in opdracht van Topsector Logistiek en het Ministerie van I&W door Panteia gebouwd en wordt door haar vervolgens onderhouden. Bij de ontwikkeling van dit TCO-model is gekozen voor een open en transparante opzet. Dit betekent dat helder is welke rekenregels zijn toegepast en welke waarde van de default data als uitgangswaarde is gehanteerd. Het TCO-model wordt mede onderschreven door RAI, evofenedex en TLN."}]
[]
[null,null,null,{"$f":"+Config!B126","v":"Nieuw in TCO-ZET-Vracht versie 4.0 (d.d. 19-9-2022):"}]
{"$rows_left_out":19}
{"sheet":"Input-Output Module","index":1,"n_rows":120,"n_cols":9,"rows_kept":120,"cut":false,"hidden":false,"merged":[[4,2,7,4],[9,5,10,5],[9,6,10,6],[40,6,40,7]]}
[]
[]
[]
[null,null,"Disclaimer:"]
[null,null,{"$f":"Config!B123","v":"De in het TCO-Vracht gebruikte default- c.q. standaardwaarden zijn met de grootste zorg verzameld. Het betreft echter gemiddelde cijfers, de werkelijke cijfers kunnen ofwel hoger dan wel lager zijn. Hoewel veel zorg is besteed aan de correctheid van de rekenregels en de gebruikte inputdata, is Panteia of de Topsector Logistiek niet aansprakelijk te houden voor de juistheid van de rekenresultaten. "}]
[]
{"$rows_left_out":115}
{"sheet":"Vergelijking Data","index":2,"n_rows":47,"n_cols":9,"rows_kept":47,"cut":false,"hidden":false,"merged":[[2,2,2,5]]}
[null,null,null,null,null,null,null,null,"Datasetnaam"]
[null,null,null,null,null,null,null,null,"basis 22 3 2022"]
[null,null,{"$f":"+Config!$B$198","v":"Vergelijking Data"},null,null,null,null,null,"minimaal trucks Vatenfall"]
[null,null,null,null,null,null,null,null,"gemiddeld trucks Vatenfall"]
[null,null,{"$f":"+Config!$B$199","v":"Selecteer DataSet"},"Test","Test","Test",null,null,"maximum trucks Vatenfall"]
[null,null,{"$f":"+Config!$B$200","v":"Voertuigscenario"},"Diesel","Elektrisch","Waterstof",null,null,"trekker 440 kW 32451 km zonder sub zonder HBE 1-4-2022"]
{"$rows_left_out":42}
{"sheet":"Invoervelden","index":5,"n_rows":23,"n_cols":9,"rows_kept":23,"cut":false,"hidden":false,"merged":[]}
["Optie","Voertuigtype","Koelmachine (J/N)","Verwacht jaarkilometrage","Grijze/groene elektriciciteit","Grijze/groene waterstof","Rechtsvorm en belastingpercentage","Basisjaar prognose","Grootte van bedrijf"]
[{"$f":"+Config!B157","v":"Defaultwaarde"},null,{"$f":"+Config!B178","v":"niet gekoeld"},null,{"$f":"+Config!B186","v":"Groen"},{"$f":"F6","v":"Electrolyse (hernieuwbare energie)"},{"$f":"+Config!B187","v":"BV of NV met 15% belasting"},2022,{"$f":"+Config!B188","v":"Groot"}]
[{"$f":"+Config!B158","v":"keuze 1"},{"$f":"+Config!B173","v":"Kleine bakwagen (lvm <12 ton)"},{"$f":"IFERROR(IF(Calculatie!$B$3>=4,Config!$B$178,Config!$B$179),Config!$B$179)","v":"niet gekoeld"},35000,{"$f":"+Config!B6","v":"Grijs"},{"$f":"Config!B6","v":"Grijs"},{"$f":"+Config!B187","v":"BV of NV met 15% belasting"},null,{"$f":"+Config!B188","v":"Groot"}]
[{"$f":"+Config!B159","v":"keuze 2"},{"$f":"+Config!B174","v":"Medium bakwagen (lvm 12-18 ton)"},{"$f":"IFERROR(IF(Calculatie!$B$3>=4,\"\",Config!$B$178),Config!$B$178)","v":""},70000,{"$f":"+Config!B186","v":"Groen"},{"$f":"Config!B7","v":"Blauw"},{"$f":"+Config!B180","v":"BV of NV met 25,8% belasting"},null,{"$f":"+Config!B183","v":"Middelgroot"}]
[{"$f":"+Config!B160","v":"keuze 3"},{"$f":"+Config!B175","v":"Grote bakwagen (lvm >18 ton)"},null,70000,null,{"$f":"Config!B8","v":"Electrolyse (netstroom)"},{"$f":"+Config!B181","v":"Eenmanszaak met 37,07% belasting"},null,{"$f":"+Config!B184","v":"Klein"}]
[{"$f":"+Config!B161","v":"keuze 4"},{"$f":"+Config!B176","v":"Lichte trekker z/opl (GVW <40 ton)"},null,100000,null,{"$f":"Config!B9","v":"Electrolyse (hernieuwbare energie)"},{"$f":"+Config!B182","v":"Eenmanszaak met 49,5% belasting"}]
{"$rows_left_out":18}
{"sheet":"Catalogus","index":6,"n_rows":57,"n_cols":21,"rows_kept":57,"cut":false,"hidden":false,"merged":[]}
["Onderstaande tabel bevat alle voertuigvarianten en kenmerken"]
["ID","Veh. Type","Veh. Type ID","Fuel","Variant ID","Name","Energy unit","Veh. Price","Energy/fuel consumption L; kWh; kg H2","Refrigeration energy/fuel consumption L; kWh; kg H2","Maintenance costs","Road tax","Tolheffing","Battery size","FC power","H2 Storage tanks","Jaarlijkse reparaties","Koeling"]
[1,{"$f":"Config!B190","v":"Kleine bakwagen"},1,"DV",1,{"$f":"+VehicleCatalogus[[#This Row],[Veh. Type]]","v":"Kleine bakwagen"},"L",{"$f":"VLOOKUP(VehicleCatalogus[[#This Row],[Name]],Indexatie!$C:$D,2,FALSE)","v":71875},0.1023274910240381,1,5.2364500000000008E-2,315.89999999999998,0,null,null,null,500,{"$f":"IFERROR(INDEX(Indexatie!$E:$E,MATCH(CONCATENATE(Config!$B$245,\" \",VehicleCatalogus[[#This Row],[Veh. Type]]),Indexatie!$C:$C,0)),0)","v":17500}]
[2,{"$f":"+Config!B191","v":"Medium bakwagen"},2,"DV",1,{"$f":"+VehicleCatalogus[[#This Row],[Veh. Type]]","v":"Medium bakwagen"},"L",{"$f":"VLOOKUP(VehicleCatalogus[[#This Row],[Name]],Indexatie!$C:$D,2,FALSE)","v":102062.49999999999},0.20136262941514174,1.5,5.7599150000000002E-2,315.89999999999998,0,null,null,null,500,{"$f":"IFERROR(INDEX(Indexatie!$E:$E,MATCH(CONCATENATE(Config!$B$245,\" \",VehicleCatalogus[[#This Row],[Veh. Type]]),Indexatie!$C:$C,0)),0)","v":20000}]
[3,{"$f":"Config!B192","v":"Grote bakwagen"},3,"DV",1,{"$f":"+VehicleCatalogus[[#This Row],[Veh. Type]]","v":"Grote bakwagen"},"L",{"$f":"VLOOKUP(VehicleCatalogus[[#This Row],[Name]],Indexatie!$C:$D,2,FALSE)","v":132250},0.28541791164119135,2.5,6.2833799999999995E-2,315.89999999999998,0,null,null,null,1000,{"$f":"IFERROR(INDEX(Indexatie!$E:$E,MATCH(CONCATENATE(Config!$B$245,\" \",VehicleCatalogus[[#This Row],[Veh. Type]]),Indexatie!$C:$C,0)),0)","v":22500}]
[4,{"$f":"+Config!B193","v":"Lichte trekker z/opl"},4,"DV",1,{"$f":"+VehicleCatalogus[[#This Row],[Veh. Type]]","v":"Lichte trekker z/opl"},"L",{"$f":"VLOOKUP(VehicleCatalogus[[#This Row],[Name]],Indexatie!$C:$D,2,FALSE)","v":109537.49999999999},0.29566505637688012,0,7.3295699999999991E-2,851.60879999999997,0,null,null,null,1500,{"$f":"IFERROR(INDEX(Indexatie!$E:$E,MATCH(CONCATENATE(Config!$B$245,\" \",VehicleCatalogus[[#This Row],[Veh. Type]]),Indexatie!$C:$C,0)),0)","v":0}]
{"$rows_left_out":52}
{"sheet":"Calculatie","index":7,"n_rows":107,"n_cols":7,"rows_kept":107,"cut":false,"hidden":false,"merged":[]}
["BASIS INVOERGEGEVENS"]
["Voertuigtype",{"$f":"LEFT(C2,FIND(\"(\",C2)-2)","v":"Zware trekker z/opl"},{"$f":"voertuigtype_input","v":"Zware trekker z/opl (GVW >40 ton)"},null,null,"test","Dit is een overgenomen veld"]
["Voertuig type ID",{"$f":"INDEX(VehicleCatalogus[#All],MATCH($B$2,VehicleCatalogus[[#All],[Veh. Type]],0),3)","v":5},null,null,null,"test","Dit is een berekening"]
["Koelmachine (J/N)",{"$f":"koelmachine","v":"niet gekoeld"}]
["Verwacht jaarkilometrage",{"$f":"DV_mileage","v":100000},{"$f":"IFERROR(INDEX(Invoervelden!$D$3:$D$17,MATCH(Calculatie!$C$2,Invoervelden!$B$3:$B$7,0)),30000)","v":100000}]
["Grijze/groene elektriciciteit",{"$f":"Electricity_type","v":"Groen"}]
{"$rows_left_out":102}
{"sheet":"M1-PowerSupply","index":8,"n_rows":57,"n_cols":8,"rows_kept":57,"cut":false,"hidden":false,"merged":[]}
["Berekening benodigde hoeveelheid energie per aandrijfvorm en bepalen aangeraden voertuigvariant"]
["Gekozen voertuigtype",{"$f":"Calculatie!B2","v":"Zware trekker z/opl"}]
["Voertuig type ID",{"$f":"INDEX(VehicleCatalogus[#All],MATCH('M1-PowerSupply'!$B$2,VehicleCatalogus[[#All],[Veh. Type]],0),3)","v":5}]
["Koelmachine (J/N)",{"$f":"Calculatie!B4","v":"niet gekoeld"}]
["Kilometers / dag",{"$f":"Calculatie!B19","v":384.61538461538464},null,null,null,null,null,"De benodigde hoeveelheid energie is berekend per type aandrijving"]
["Productieve uren per dag",{"$f":"Calculatie!B18","v":10},null,null,null,null,null,"Per type aandrijving is een coefficient bekend (zie voertuigcatalogus) voor de benodige hoeveelheid energie per km en per uur (voor koeleenheid)"]
{"$rows_left_out":52}
{"sheet":"M2-Subsidie","index":9,"n_rows":57,"n_cols":11,"rows_kept":57,"cut":false,"hidden":false,"merged":[]}
["Parameters"]
["Maximale steun op grond van EU-staatssteunkalender"]
["Omvang bedrijf","Maximale steun (% van meerprijs)","Toelichting",null,null,null,null,"Maximale steun per categorie"]
[{"$f":"+Config!B188","v":"Groot"},0.4,">250 fte, >€50 mil omzet",null,null,null,null,"AanZET categorie","Omvang bedrijf","Max. steun [%]","Max. steun [€]"]
[{"$f":"+Config!B183","v":"Middelgroot"},0.5,"<250 fte, <€50 mil omzet",null,null,null,null,"N2",{"$f":"+Config!B188","v":"Groot"},0.125,17800]
[{"$f":"+Config!B184","v":"Klein"},0.6,"<50 fte, <€10 mil omzet",null,null,null,null,"N3 Bakwagen",{"$f":"+Config!B188","v":"Groot"},0.2,43600]
{"$rows_left_out":52}
{"sheet":"Parameters","index":10,"n_rows":93,"n_cols":8,"rows_kept":93,"cut":false,"hidden":false,"merged":[]}
["INZETGEGEVENS VOERTUIG SYSTEM"]
["Productieve dagen per jaar",260]
["Max. tijd per dag opladen extern",1]
["Max. aantal sessies per dag opladen extern",1]
[]
["ENERGIE EN EMISSIE GEGEVENS VOERTUIGEN"]
{"$rows_left_out":88}
{"sheet":"Indexatie","index":11,"n_rows":51,"n_cols":15,"rows_kept":51,"cut":false,"hidden":false,"merged":[[0,4,0,12]]}
["GEÏNDEXEERDE COËFFICIËNTEN",null,null,null,"Indices"]
["Categorie","Subcategorie","Coëfficiënt","Gebruikte waarde","grondvoet",2022,2023,2024,2025,2026,2027,2028,2029,2030,"Toelichting"]
["Basisjaar","Basisjaar","Basisjaar",{"$f":"'Input-Output Module'!B20","v":2022},null,{"$f":"IF($D$3>=F2,1,0)","v":1},0,0,0,0,0,0,0,0]
["Energieprijs","Diesel",{"$f":"+Config!B195","v":"Dieselprijs (ex btw en accijns)"},{"$f":"E4*IF(F4*F$3>0,F4,1)*IF(G4*G$3>0,G4,1)*IF(H4*H$3>0,H4,1)*IF(I4*I$3>0,I4,1)*IF(J4*J$3>0,J4,1)*IF(K4*K$3>0,K4,1)*IF(L4*L$3>0,L4,1)*IF(M4*M$3>0,M4,1)*IF(N4*N$3>0,N4,1)","v":1.5},1.5,1]
["Energieprijs","Diesel",{"$f":"+Config!B44","v":"Dieselaccijns"},0.42,0.42,1]
["Energieprijs","Waterstof",{"$f":"Config!B6","v":"Grijs"},7.56,7.56,1]
{"$rows_left_out":46}
{"sheet":"Database","index":12,"n_rows":4,"n_cols":104,"rows_kept":4,"cut":false,"hidden":false,"merged":[]}
["Datasetnaam",{"$f":"Config!$B$200","v":"Voertuigscenario"},{"$f":"Config!$B$204","v":"Creatiedatum"},{"$f":"Config!$B$205","v":"Voertuigtype"},{"$f":"Config!$B$206","v":"Koelmachine (J/N)"},{"$f":"Config!$B$207","v":"Verwacht jaarkilometrage"},{"$f":"Config!$B$208","v":"Grijze/groene elektriciciteit"},{"$f":"Config!$B$209","v":"Grijze/groene waterstof"},{"$f":"Config!$B$210","v":"Rechtsvorm en belastingpercentage"},{"$f":"Config!$B$211","v":"Jaar prognose"},{"$f":"Config!$B$212","v":"Economische levensduur "},{"$f":"Config!$B$214","v":"Productieve uren per jaar"},{"$f":"Config!$B$215","v":"Kosten van reparaties"},{"$f":"Config!$B$218","v":"Capaciteit vrachtwagenbatterij (kWh) "},{"$f":"Config!$B$220","v":"Bruto aankoopprijs "},{"$f":"Config!$B$221","v":"Subsidies"},{"$f":"Config!$B$222","v":"Netto aankoopprijs"},{"$f":"Config!$B$224","v":"Basisprijs energie"},{"$f":"Config!$B$213","v":"Restwaarde "},{"$f":"Config!$B$216","v":"Stilstand dagen per jaar"},{"$f":"Config!B217","v":"Vermogen eigen oplaadsysteem (kW)"},{"$f":"Config!B219","v":"Waterstof opslag tank (kg)"},{"$f":"Config!$B$223","v":"Netto kosten inkoop & aanleg oplaadsysteem"},{"$f":"Config!$B$44","v":"Dieselaccijns"},{"$f":"Config!$B$46","v":"Meerprijs tolheffing"},{"$f":"Config!$B$47","v":"Aandeel snelweg kilometers"},{"$f":"Config!$B$48","v":"Vaste ZE-Voertuigheffing"},{"$f":"Config!$B$49","v":"CO2 prijs"},{"$f":"Config!$B$226","v":"Scenario"},{"$f":"Config!$B$227","v":"Scenario validiteit"},"Column1",{"$f":"Config!$B$228","v":"Voertuig"},{"$f":"Config!B229","v":"Eigen oplaadsysteem"},{"$f":"Config!$B$230","v":"Openbaar oplaadsysteem"},"Column3",{"$f":"Config!$B$231","v":"Percentage eigen oplaadsysteem"},{"$f":"Config!$B$232","v":"Percentage extern (openbaar) Oplaadsysteem"},"Column4",{"$f":"Config!$B$233","v":"Totale kosten per jaar"},{"$f":"Config!$B$234","v":"Totale kosten per km"},{"$f":"Config!$B$235","v":"Totale kosten per uur"},"Column5",{"$f":"Config!$B$239","v":"Emissies (totaal per jaar voor het geselecteerde voertuig)"},{"$f":"Config!$B$240","v":"CO2 emissies (ton per jaar, WtW)"},{"$f":"Config!$B$241","v":"PM totaal (kg per jaar, TtW)"},{"$f":"Config!$B$242","v":"NOx (kg per jaar, TtW)"},"Column6","Column7","ONDERBOUWING KOSTENBEREKENING","Vaste kosten per jaar","Wegenbelasting","Eurovignet","Rente","Verzekering","Voertuigheffing","Diverse overige voertuigkosten","a: Totale vaste voertuigkosten per jaar","Fixed transport costs","Variabele kosten per jaar","Afschrijving voertuig","Brandstofverbruik voertuig","Brandstofverbruik koeling","Elektriciteitsverbruik","H2 verbruik","Adblue verbruik","Banden","Onderhoud","Reparatie","Reparatie/onderhoud koelunit","Verschil Tolheffing (km-tarief)","CO2-prijs","Hernieuwbare Brandstof-Eenheden","Specifieke vervoerskosten ","b: Totale variabele voertuigkosten per jaar","Repair, maintenance & tires","Kosten oplaadsysteem per jaar","Aankoop en installatie","Operationele kosten","c: Totale kosten oplaadsysteem per jaar",null,"Totale voertuig en oplaadsysteemkosten per jaar (a+b+c) ","Totale voertuig en oplaadsysteemkosten per km: (a+b+c)/kms per jaar","Totale voertuig en oplaadsysteemkosten per uur (a+b+c)/uren per jaar",null,"Chauffeurskosten","Uurloon incl. sociale lasten","Verblijfkostenvergoeding","Overige kosten","d: Totale chauffeurskosten per jaar",null,"Totale directe kosten per jaar (a+b+c+d)","Totale directe kosten per km: (a+b+c+d)/kms per jaar","Totale directe kosten per uur (a+b+c+d)/uren per jaar",null,"Algemene kosten (overhead)","Loon incl. sociale lasten","Huisvesting","Overig","e: Totale overhead per jaar",{"$f":"Config!$B$236","v":"HBE Toepassen (J/N)"},{"$f":"Config!$B$237","v":"Aantal HBE's"},"Forfait","Waarde per HBE",{"$f":"Config!$B$238","v":"Totale waarde HBE's"}]
["Test","Diesel",44729,"Medium bakwagen","niet gekoeld",70000,"Groen","Electrolysis RE","BV of NV met 15% belasting",2021,7,2600,1500,"nvt",88750,0,88750,1.6,20510.259999999998,0,"nvt","nvt","nvt",0.53,0,0,0,0,"Diesel","nvt",null,"Medium bakwagen","nvt","nvt",null,"nvt","nvt",null,138505.01978959292,1.9786431398513273,53.27116145753574,null,null,45.657259186752313,6.2592770289873965,64.838766671675643,null,null,null,null,315.12,750,1447.69849816693,2662.5,0,73.83,5249.14849816693,null,null,9748.5337124859307,23240.582678487317,0,0,0,149.61423981923249,1344.0000000000002,3850,1500,0,0,0,0,375,40207.730630792481,null,null,0,0,0,null,45456.879128959408,0.64938398755656301,17.483415049599774,null,null,70538,2210,1196,73944,null,119400.87912895941,1.70572684469942,45.923415049599775,null,null,10029.673846832591,3104.4228573529444,5970.0439564479711,19104.140660633508]
["Test","Diesel",44729,"Medium bakwagen","niet gekoeld",70000,"Groen","Electrolysis RE","BV of NV met 15% belasting",2021,10,2580,5000,180,183250,17621.55,165794.5,0.08,22573.22,2,20,"nvt",2908.95,0.53,0,0,0,0,"EV Optimale mix","Scenario valide",null,"Medium bakwagen 180 kWh","AC20","HPC150",null,0.56444010086310603,0.43555989913689397,null,149885.83148180239,2.1412261640257486,58.095283520078446,null,null,0,5.6844816480881075,"nvt",null,null,null,null,0,750,2495.8723140356492,5497.5,0,73.83,8817.2023140356487,null,null,14322.127818598872,0,0,16992.860148796681,0,0,1344.0000000000002,1925,5000,0,0,0,0,375,39958.987967395551,null,null,290.8949999999997,1334,1624.8949999999998,null,50401.085281431195,0.72001550402044567,19.535304372647751,null,null,75180.662660241607,2355.4575474089702,1274.7182021272076,78810.838409777774,null,129211.92369120897,1.8458846241601281,50.08214096558487,null,null,10853.801590061554,3359.5100159714329,6460.5961845604488,20673.907790593435,"N",955,1,18,0]
["Test","Diesel",44729,"Medium bakwagen","niet gekoeld",70000,"Groen","Electrolysis RE","BV of NV met 15% belasting",2021,10,2550,10000,150,349715.25,39761.839999999997,309953.40999999997,10,43078.85,5,"nvt",15,"nvt",0.53,0,0,0,0,"Waterstof voertuig","nvt",null,"Medium bakwagen 40 kW","nvt","nvt",null,"nvt","nvt",null,177317.91800841462,2.5331131144059231,69.536438434672405,null,null,0,5.6844816480881075,"nvt",null,null,null,null,0,750,4677.6774454423239,10491.4575,0,73.83,15992.964945442325,null,null,26687.455296661716,0,0,0,43869.853903080984,0,1344.0000000000002,5775,10000,0,0,0,-23706,375,64345.309199742696,null,null,0,0,0,null,80338.274145185016,1.1476896306455002,31.505205547131379,null,null,69181.5,2167.5,1173,72522,null,152860.27414518502,2.1837182020740715,59.94520554713138,null,null,12840.263028195543,3974.3671277748103,7643.0137072592515,24457.643863229605,"J",1317,null,18,23706]

{"sheet":"Dynamic","index":13,"n_rows":96,"n_cols":8,"rows_kept":96,"cut":false,"hidden":false,"merged":[]}
[null,null,null,"Jaarlijkse verandering (%)","Geaggregeerd"]
[null,"Diesel prijs",null,{"$f":"Parameters!B25","v":0.01},{"$f":"(1-(1+D2)^DV_age)/(1-(1+D2))/DV_age","v":1.0305050301001395}]
[]
[null,"Opladen","Aanschaf en installatie",{"$f":"Parameters!B26","v":1.6E-2}]
[null,null,"Operationele kosten",{"$f":"Parameters!B27","v":1.6E-2}]
[null,"Energie prijs","AC3,7",{"$f":"Parameters!B28","v":0.01},{"$f":"(1-(1+D6)^EV_age)/(1-(1+D6))/EV_age","v":1.0305050301001395}]
{"$rows_left_out":91}
{"sheet":"Breakeven analyse","index":14,"n_rows":150,"n_cols":21,"rows_kept":150,"cut":false,"hidden":false,"merged":[]}
[]
[]
[null,null,null,null,"1. Buy in Year 0 - which year will it become breakeven"]
[null,null,null,null,"2. Buy in Year x - which year will it become cheaper to buy EV"]
[]
[null,null,null,null,"Fleet prognosis - vans and trucks"]
{"$rows_left_out":145}
{"sheet":"kostenmodel laadplein2022","index":15,"n_rows":114,"n_cols":15,"rows_kept":114,"cut":false,"hidden":false,"merged":[]}
["Basis"]
["TCO-ZET-Vracht"]
["Index","Charging type","Power","Land type","Column1","Power (kW)","Depth of discharge (%)","Efficiency (%)","Column2","Installation costs (€)","Operational costs annual (€)","Own energy costs (€)","External energy costs (€)"]
[1,"AC3,7","3,7 kW","Privaat",null,3.7,0.8,0.85799999999999998,null,270,25,0.20500000000000002,{"$f":"Charging_system_table1114[[#This Row],[Own energy costs (€)]]","v":0.20500000000000002}]
[2,"AC10","10 kW","Publiek",null,10,0.8,0.90200000000000002,null,1620,600,null,0.30759999999999998]
[3,"AC20","20 kW","Publiek",null,20,0.8,0.90200000000000002,null,1620,1295,null,0.4466]
{"$rows_left_out":109}
{"sheet":"Config","index":16,"n_rows":460,"n_cols":17,"rows_kept":460,"cut":false,"hidden":false,"merged":[]}
["Col. No",{"$f":"'Read Me'!B1","v":"Nederlands"},"Nederlands","English"]
[2,{"$f":"+HLOOKUP($B$1,$C$1:$D$505,$A2,0)","v":"J"},"J","Y",null,null,null,{"$f":"IF(Calculatie!$B$3>=4,Config!$B$3,Config!$B$2)","v":"N"},null,null,null,null,null,null,"DV","EV","FC"]
[{"$f":"+A2+1","v":3},"N","N","N",null,null,null,{"$f":"IF(Calculatie!$B$3>=4,\"\",Config!$B$3)","v":""},null,null,null,null,null,"Restwaarde",{"$f":"TEXT(Calculatie!B39,\"€#.##0,00\")","v":"€29.234,35"},{"$f":"TEXT(Calculatie!C39,\"€#.##0,00\")","v":"€87.818,60"},{"$f":"TEXT(Calculatie!D39,\"€#.##0,00\")","v":"€138.138,75"}]
[{"$f":"+A3+1","v":4},"Opslaan","Opslaan","Save",null,null,null,"Speciaal voor Koeling",null,null,null,null,null,"Vermogen eigen oplaadsysteem (kW)",null,{"$f":"CONCATENATE('M1-PowerSupply'!B36,\" kW/u\")","v":"50 kW/u"}]
[5,"Toegepaste waarde:","Toegepaste waarde:","Applied value:",null,null,null,null,null,null,null,null,null,"Capaciteit vrachtwagenbatterij (kWh) ",null,{"$f":"CONCATENATE(Calculatie!C26,\" kWh\")","v":"490 kWh"},{"$f":"CONCATENATE(Calculatie!D26,\" kWh\")","v":"200 kWh"}]
[6,"Grijs","Grijs","Gray",null,null,null,null,null,null,null,null,null,"Waterstof opslag tank (kg)",null,null,{"$f":"CONCATENATE(Calculatie!D32,\" kg\")","v":"50 kg"}]
{"$rows_left_out":454}